{"text_format":"1","workbook":"xlsx","n_sheets":17,"sheets":["Расчет","Калькулятор_от дохода","Параметры","Печать","Расчет по доходу заемщика","Справочники и промежут.расчет","График_польз.срок","График_180","График_240","График_300","График_360","Прогноз переменной ставки","Графики","ШаблонПечати","Справочник","Инструкция","Лист1"],"not_rendered":{"charts":2,"images":2,"macros":1,"external_links":0,"defined_names":58,"comments":0,"pivot_tables":0},"unopened":[],"bounds":{"document_bytes":16777216,"sheet_cells":100000,"rows_first":2000,"rows_last":500,"rows_between":2000,"halvings":0,"cell_chars":16384,"cell_head_chars":4096},"cells_cut":0,"cells_raw":0,"read":"whole","date_system":"1900"}

{"sheet":"Расчет","index":0,"n_rows":404,"n_cols":26,"rows_kept":404,"cut":false,"hidden":true,"merged":[[0,0,0,13]]}
["Кредит (займ) по ЦЖЗ"]
["Номер процентного периода","Кол-во дней в процентном периоде","Последняя дата процентного периода","ООД на начало периода","Платеж по кредиту (займу)","Начисленные проценты  по основному долгу","Уплаченные проценты по основному долгу ","Аморти-зация основного долга","ООД на конец периода","Плановая накопленная процентная задолженность на начало периода","Начисленные проценты по накопленной процентной задолжен-ности","Уплаченные проценты по накоплен-ной процентной задолжен-ности","Рост (+) / погашение (-) задолженности","Плановая накопленная процентная задолжен-ность на конец периода"]
[1,2,3,4,5,6,7,8,9,10,11,12,13,14]
[1,14,"2016-08-31",2600000,0,11099.02,null,null,2600000,0,0,null,null,0,null,null,null,null,null,null,null,null,null,null,null,{"$f":"IF(M4>0,0,-M4)","v":0}]
[2,30,"2016-09-30",2600000,39403.020000000004,22718.03,33817.050000000003,5585.9700000000012,2594414.0300000003,0,0,0,0,0,null,null,null,null,null,null,null,null,null,null,null,0]
[3,31,"2016-10-31",2594414.0300000003,28304,23424.87,23424.87,4879.130000000001,2589534.9,0,0,0,0,0,null,null,null,null,null,null,null,null,null,null,null,0]
[4,30,"2016-11-30",2589534.9,28304,22626.59,22626.59,5677.41,2583857.4900000002,0,0,0,0,0,null,null,null,null,null,null,null,null,null,null,null,0]
[5,31,"2016-12-31",2583857.4900000002,28304,23329.55,23329.55,4974.4500000000007,2578883.04,0,0,0,0,0,null,null,null,null,null,null,null,null,null,null,null,0]
[6,31,"2017-01-31",2578883.04,28304,20588.670000000002,20588.670000000002,7715.3299999999981,2571167.71,0,0,0,0,0,null,null,null,null,null,null,null,null,null,null,null,0]
[7,28,"2017-02-28",2571167.71,28304,18540.580000000002,18540.580000000002,9763.4199999999983,2561404.29,0,0,0,0,0,null,null,null,null,null,null,null,null,null,null,null,0]
[8,31,"2017-03-31",2561404.29,28304,20449.13,20449.13,7854.869999999999,2553549.42,0,0,0,0,0,null,null,null,null,null,null,null,null,null,null,null,0]
[9,30,"2017-04-30",2553549.42,28304,19728.79,19728.79,8575.2099999999991,2544974.21,0,0,0,0,0,null,null,null,null,null,null,null,null,null,null,null,0]
[10,31,"2017-05-31",2544974.21,28304,20317.96,20317.96,7986.0400000000009,2536988.17,0,0,0,0,0,null,null,null,null,null,null,null,null,null,null,null,0]
[11,30,"2017-06-30",2536988.17,28304,19600.84,19600.84,8703.16,2528285.0100000002,0,0,0,0,0,null,null,null,null,null,null,null,null,null,null,null,0]
[12,31,"2017-07-31",2528285.0100000002,28304,20184.72,20184.72,8119.2799999999988,2520165.73,0,0,0,0,0,null,null,null,null,null,null,null,null,null,null,null,0]
{"$rows_left_out":390}
{"sheet":"Калькулятор_от дохода","index":1,"n_rows":206,"n_cols":28,"rows_kept":206,"cut":false,"hidden":false,"merged":[[52,15,52,21],[56,15,56,21],[58,15,58,21],[61,13,61,21],[54,15,54,21],[50,15,50,21],[33,12,33,13],[36,12,36,13],[38,12,38,13],[40,12,40,13],[44,12,44,13],[44,15,44,21],[46,15,46,21],[48,15,48,21],[27,15,27,19],[5,12,7,21],[11,15,11,19],[15,17,15,19],[17,15,17,19],[19,15,19,17]]}
[]
[]
[null,null,null,null,null,null,null,null,null,null,null,null,"Версия 1.29."]
[]
[]
[null,null,null,null,null,null,null,null,null,null,null,null,"ПРЕДВАРИТЕЛЬНЫЙ РАСЧЕТ ПАРАМЕТРОВ КРЕДИТОВАНИЯ"]
[]
[]
[]
[]
[]
[null,null,null,null,null,null,null,null,null,null,null,null,"Продукт",null,null,"Приобретение жилья на этапе строительства",null,null,null,null,null,{"$f":"IF(P12=$M$120,\"Заявки до 30.12.2016\",\"\")","v":""}]
[]
[null,null,null,null,null,null,null,null,null,null,null,null,"Опции"]
[]
{"$rows_left_out":192}
{"sheet":"Параметры","index":2,"n_rows":39,"n_cols":10,"rows_kept":39,"cut":false,"hidden":true,"merged":[[0,1,0,10],[19,3,19,5],[3,5,3,7],[5,5,5,7],[1,1,1,10],[11,3,11,7],[13,3,13,5],[29,3,29,5],[23,3,23,5],[38,1,39,5],[35,3,35,7],[7,5,7,7],[21,3,21,5],[17,2,17,7],[30,3,30,7]]}
[]
[null,"Ипотечный калькулятор \n\"Переменная ставка\" "]
[]
[null,null,null,"ФИО"]
[]
[null,null,null,"Договор №"]
[]
[null,null,null,"Дата договора"]
[]
[]
[]
[null,null,null,"Расчетные параметры"]
[]
[null,null,null,"Дата выдачи кредита (займа)",null,null,null,"2016-08-01"]
[]
{"$rows_left_out":25}
{"sheet":"Печать","index":3,"n_rows":191,"n_cols":15,"rows_kept":191,"cut":false,"hidden":true,"merged":[[184,1,184,14],[186,1,186,14],[188,1,188,14],[190,1,190,14],[11,3,11,6],[12,7,12,8],[14,1,15,1],[14,2,15,2],[14,3,15,3],[14,11,15,11],[12,3,12,6],[13,0,13,14],[14,0,15,0],[14,8,15,8],[14,12,14,14],[14,4,14,5],[0,0,0,12],[5,3,5,6],[5,7,5,8],[6,3,6,6],[6,7,6,8],[4,5,4,9],[2,3,2,4],[14,7,15,7],[2,5,2,9],[14,6,15,6],[7,3,7,6],[14,9,14,10],[10,3,10,6],[3,5,3,9],[3,3,3,4],[11,7,11,8],[4,3,4,4],[8,7,8,8],[8,3,8,6],[10,7,10,8],[7,7,7,8]]}
["ГРАФИК ЕЖЕМЕСЯЧНЫХ ПЛАТЕЖЕЙ ПО КРЕДИТУ (ЗАЙМУ) \nс опцией \"Переменная ставка\""]
[]
[null,null,null,"ФИО заемщика"]
[null,null,null,"Договор №"]
[null,null,null,"Дата договора"]
[null,null,null,"Сумма кредита (займа)",null,null,null,{"$f":"SubsCredSumm","v":900000},null,"руб."]
[null,null,null,"Дата выдачи кредита (займа)",null,null,null,{"$f":"GiveDate","v":"2016-08-01"}]
[null,null,null,"Процентная ставка на момент выдачи",null,null,null,0.1066,null,"годовых"]
[null,null,null,"Срок кредита (займа)",null,null,null,{"$f":"Параметры!H22","v":360},null,"мес."]
[]
[null,null,null,"Расчетная дата",null,null,null,"???"]
[null,null,null,"Нак. взнос в 2016 году",null,null,null,0,null,"руб."]
[null,null,null,"Размер ежемесячного платежа",null,null,null,28304,null,"руб."]
[]
["Процентный период","Последняя дата процентного периода","Количес-тво дней в процент-ном периоде","Процентная ставка ","Ожидаемый задолженность на начало периода, руб.",null,"Ежемесяч-ный платеж","Начисление % на ОД, руб."," \n  Погашение %, руб. \n ","Погашение",null,"Накопленные проценты за период, руб.","Ожидаемый задолженность на конец периода, руб."]
{"$rows_left_out":177}
{"sheet":"Расчет по доходу заемщика","index":4,"n_rows":82,"n_cols":9,"rows_kept":82,"cut":false,"hidden":true,"merged":[]}
[]
[null,null,"Ипотечный продукт",null,{"$f":"'Калькулятор_от дохода'!$P$12","v":"Приобретение жилья на этапе строительства"}]
[null,null,"Регион предмета ипотеки",null,{"$f":"'Калькулятор_от дохода'!$P$28","v":"г.Москва"}]
[]
[null,null,"Доходы заемщика:",null,"Заемщик 1:","Заемщик 2:","Заемщик 3:","Заемщик 4:"]
[null,null,"Средний доход заемщика за последние 6 мес. за вычетом налоговых отчислений, руб.",null,{"$f":"'Калькулятор_от дохода'!P34","v":0},{"$f":"'Калькулятор_от дохода'!R34","v":0},{"$f":"'Калькулятор_от дохода'!T34","v":0},{"$f":"'Калькулятор_от дохода'!V34","v":0}]
[null,null,"Обязательства заемщика:"]
[null,null,"Алименты, руб.",null,{"$f":"'Калькулятор_от дохода'!P37","v":0},{"$f":"'Калькулятор_от дохода'!R37","v":0},{"$f":"'Калькулятор_от дохода'!T37","v":0},{"$f":"'Калькулятор_от дохода'!V37","v":0}]
[null,null,"Ежемесячные платежи по текущим кредитным обязательствам, с оставшимся сроком исполнения более 3 месяцев, руб.",null,{"$f":"'Калькулятор_от дохода'!P39","v":0},{"$f":"'Калькулятор_от дохода'!R39","v":0},{"$f":"'Калькулятор_от дохода'!T39","v":0},{"$f":"'Калькулятор_от дохода'!U39","v":0}]
[null,null,"Лимит по кредитным картам (вне зависимости от факта его использования), руб.",null,{"$f":"'Калькулятор_от дохода'!P41","v":0},{"$f":"'Калькулятор_от дохода'!R41","v":0},{"$f":"'Калькулятор_от дохода'!T41","v":0},{"$f":"'Калькулятор_от дохода'!V41","v":0}]
[null,null,"Расходы по кредитным картам, принимаемые в расчет, руб.",null,{"$f":"E10*'Справочники и промежут.расчет'!$D$8","v":0},{"$f":"F10*'Справочники и промежут.расчет'!$D$8","v":0},{"$f":"G10*'Справочники и промежут.расчет'!$D$8","v":0},{"$f":"H10*'Справочники и промежут.расчет'!$D$8","v":0}]
[null,null,"Классификация кредитной истории заемщика"]
[null,null,"возраст заемщика",null,{"$f":"'Калькулятор_от дохода'!P43","v":0},{"$f":"'Калькулятор_от дохода'!R43","v":0},{"$f":"'Калькулятор_от дохода'!T43","v":0},{"$f":"'Калькулятор_от дохода'!V43","v":0}]
[]
[null,null,"Совокупный доход заемщиков, руб.",null,{"$f":"SUM(E6:H6)","v":0}]
{"$rows_left_out":68}
{"sheet":"Справочники и промежут.расчет","index":5,"n_rows":169,"n_cols":24,"rows_kept":169,"cut":false,"hidden":true,"merged":[[71,9,71,10]]}
[]
[1,"Ипотечный продукт",2,"Классификация кредитной истории"]
[null,"Приобретение готового жилья",null,"Положительная"]
[null,"Приобретение жилья на этапе строительства",null,"Неопределенная"]
[null,"Ипотека с гос.поддержкой"]
[null,"Целевой кредит под залог имеющейся квартиры"]
[null,"Перекредитование",3,"Норма учета в расходах лимита по кредитным картам"]
[null,null,null,0.08]
[]
[4,"Значение коэффициентов О/Д"]
[null,0.6]
[]
[]
[]
[]
{"$rows_left_out":155}
{"sheet":"График_польз.срок","index":6,"n_rows":372,"n_cols":20,"rows_kept":372,"cut":false,"hidden":true,"merged":[]}
[]
[null,"Параметр ",null,"Значение"]
[null,"Сумма кредита",null,{"$f":"'Калькулятор_от дохода'!$N$66","v":0}]
[null,"Первоначальный срок, мес.",null,{"$f":"'Расчет по доходу заемщика'!$E$41","v":360}]
[null,"Ежемесячный платеж",null,{"$f":"'Калькулятор_от дохода'!$N$72","v":0}]
[null,"Расчетный период полного погашения",null,{"$f":"MATCH(0,K12:K372,0)-1","v":0}]
[null,"остаток долга на конец срока кредита",null,{"$f":"VLOOKUP(D4+1,$F$12:$L$263,4)","v":9.9000000000000005E-2}]
[null,"Переплата",null,{"$f":"SUM($J$12:$J$311)-D3","v":0},null,null,null,null,null,null,null,null,"График платежей"]
[null,"дата выдачи",null,{"$f":"'Калькулятор_от дохода'!$V$20","v":"2017-04-01"}]
[null,null,null,null,null,null,"Последняя дата процентного периода","Кол-во дней в процентном периоде","Ставка для расчетов","Ежемесячный платеж","Общий долг на начало","Остаток кредита на начало","Накопленные %% на начало","Начислено за месяц","Погашение кредита","Погашение текущих %","Погашение накопленных %%","Формирование накопленных %%","Остаток кредита на конец периода","Накопленные %% на конец периода"]
[null,null,null,null,null,1,2,3,2,3,4,5,6,7,8,9,10,11,12,13]
[null,null,null,null,null,1,{"$f":"EOMONTH($D$9,F12-1)","v":"2017-04-30"},{"$f":"G12-D9","v":29},{"$f":"VLOOKUP(G12,'Прогноз переменной ставки'!$B$5:$E$304,4,1)","v":0.10880000000000001},{"$f":"IF(F12=$D$4,K12+N12,MIN($D$5,K12+N12))","v":0},{"$f":"L12+M12","v":0},{"$f":"D3","v":0},0,{"$f":"L12*I12/365.25*H12","v":0},{"$f":"MIN(J12-Q12-P12,L12)","v":0},{"$f":"MIN(J12-Q12,N12)","v":0},{"$f":"MIN(J12,M12)","v":0},{"$f":"MAX(N12-P12,0)","v":0},{"$f":"L12-O12","v":0},{"$f":"M12+R12-Q12","v":0}]
[null,null,null,null,null,2,{"$f":"EOMONTH($D$9,F13-1)","v":"2017-05-31"},{"$f":"G13-G12","v":31},{"$f":"VLOOKUP(G13,'Прогноз переменной ставки'!$B$5:$E$304,4,1)","v":0.10880000000000001},{"$f":"IF(F13=$D$4,K13+N13,MIN($D$5,K13+N13))","v":0},{"$f":"L13+M13","v":0},{"$f":"S12","v":0},{"$f":"T12","v":0},{"$f":"L13*I13/365.25*H13","v":0},0,0,0,{"$f":"MAX(N13-P13,0)","v":0},0,0]
[null,null,null,null,null,3,"2017-06-30",{"$f":"G14-G13","v":30},{"$f":"VLOOKUP(G14,'Прогноз переменной ставки'!$B$5:$E$304,4,1)","v":0.10880000000000001},0,0,{"$f":"S13","v":0},0,0,0,0,0,{"$f":"MAX(N14-P14,0)","v":0},0,0]
[null,null,null,null,null,4,"2017-07-31",31,{"$f":"VLOOKUP(G15,'Прогноз переменной ставки'!$B$5:$E$304,4,1)","v":9.2300000000000007E-2},0,0,0,0,0,0,0,0,0,0,0]
{"$rows_left_out":358}
{"sheet":"График_180","index":7,"n_rows":311,"n_cols":20,"rows_kept":311,"cut":false,"hidden":true,"merged":[]}
[]
[null,"Параметр ",null,"Значение"]
[null,"Сумма кредита",null,{"$f":"'Калькулятор_от дохода'!$P$66","v":0}]
[null,"Первоначальный срок, мес.",null,{"$f":"'Расчет по доходу заемщика'!$F$41","v":180}]
[null,"Ежемесячный платеж",null,{"$f":"'Калькулятор_от дохода'!$P$72","v":0}]
[null,"Расчетный период полного погашения",null,{"$f":"MATCH(0,K12:K263,0)-1","v":0}]
[null,"остаток долга на конец срока кредита",null,{"$f":"VLOOKUP(D4+1,$F$12:$L$263,4)","v":9.9000000000000005E-2}]
[null,"Переплата",null,{"$f":"SUM($J$12:$J$311)-D3","v":0},null,null,null,null,null,null,null,null,"График платежей"]
[null,"дата выдачи",null,{"$f":"'Калькулятор_от дохода'!$V$20","v":"2017-04-01"}]
[null,null,null,null,null,null,"Последняя дата процентного периода","Кол-во дней в процентном периоде","Ставка для расчетов","Ежемесячный платеж","Общий долг на начало","Остаток кредита на начало","Накопленные %% на начало","Начислено за месяц","Погашение кредита","Погашение текущих %","Погашение накопленных %%","Формирование накопленных %%","Остаток кредита на конец периода","Накопленные %% на конец периода"]
[null,null,null,null,null,1,2,3,2,3,4,5,6,7,8,9,10,11,12,13]
[null,null,null,null,null,1,{"$f":"EOMONTH($D$9,F12-1)","v":"2017-04-30"},{"$f":"G12-D9","v":29},{"$f":"VLOOKUP(G12,'Прогноз переменной ставки'!$B$5:$E$304,4,1)","v":0.10880000000000001},{"$f":"IF(F12=$D$4,K12+N12,MIN($D$5,K12+N12))","v":0},{"$f":"L12+M12","v":0},{"$f":"D3","v":0},0,{"$f":"L12*I12/365.25*H12","v":0},{"$f":"MIN(J12-Q12-P12,L12)","v":0},{"$f":"MIN(J12-Q12,N12)","v":0},{"$f":"MIN(J12,M12)","v":0},{"$f":"MAX(N12-P12,0)","v":0},{"$f":"L12-O12","v":0},{"$f":"M12+R12-Q12","v":0}]
[null,null,null,null,null,2,{"$f":"EOMONTH($D$9,F13-1)","v":"2017-05-31"},{"$f":"G13-G12","v":31},{"$f":"VLOOKUP(G13,'Прогноз переменной ставки'!$B$5:$E$304,4,1)","v":0.10880000000000001},{"$f":"IF(F13=$D$4,K13+N13,MIN($D$5,K13+N13))","v":0},{"$f":"L13+M13","v":0},{"$f":"S12","v":0},{"$f":"T12","v":0},{"$f":"L13*I13/365.25*H13","v":0},0,0,0,{"$f":"MAX(N13-P13,0)","v":0},0,0]
[null,null,null,null,null,3,"2017-06-30",{"$f":"G14-G13","v":30},{"$f":"VLOOKUP(G14,'Прогноз переменной ставки'!$B$5:$E$304,4,1)","v":0.10880000000000001},0,0,{"$f":"S13","v":0},0,0,0,0,0,{"$f":"MAX(N14-P14,0)","v":0},0,0]
[null,null,null,null,null,4,"2017-07-31",31,{"$f":"VLOOKUP(G15,'Прогноз переменной ставки'!$B$5:$E$304,4,1)","v":9.2300000000000007E-2},0,0,0,0,0,0,0,0,0,0,0]
{"$rows_left_out":297}
{"sheet":"График_240","index":8,"n_rows":311,"n_cols":20,"rows_kept":311,"cut":false,"hidden":true,"merged":[]}
[]
[null,"Параметр ",null,"Значение"]
[null,"Сумма кредита",null,{"$f":"'Калькулятор_от дохода'!$R$66","v":0}]
[null,"Первоначальный срок, мес.",null,{"$f":"'Расчет по доходу заемщика'!$G$41","v":240}]
[null,"Ежемесячный платеж",null,{"$f":"'Калькулятор_от дохода'!$R$72","v":0}]
[null,"Расчетный период полного погашения",null,{"$f":"MATCH(0,K12:K263,0)-1","v":0}]
[null,"остаток долга на конец срока кредита",null,{"$f":"VLOOKUP(D4+1,$F$12:$L$263,4)","v":9.9000000000000005E-2}]
[null,"Переплата",null,{"$f":"SUM($J$12:$J$311)-D3","v":0},null,null,null,null,null,null,null,null,"График платежей"]
[null,"дата выдачи",null,{"$f":"'Калькулятор_от дохода'!$V$20","v":"2017-04-01"}]
[null,null,null,null,null,null,"Последняя дата процентного периода","Кол-во дней в процентном периоде","Ставка для расчетов","Ежемесячный платеж","Общий долг на начало","Остаток кредита на начало","Накопленные %% на начало","Начислено за месяц","Погашение кредита","Погашение текущих %","Погашение накопленных %%","Формирование накопленных %%","Остаток кредита на конец периода","Накопленные %% на конец периода"]
[null,null,null,null,null,1,2,3,2,3,4,5,6,7,8,9,10,11,12,13]
[null,null,null,null,null,1,{"$f":"EOMONTH($D$9,F12-1)","v":"2017-04-30"},{"$f":"G12-D9","v":29},{"$f":"VLOOKUP(G12,'Прогноз переменной ставки'!$B$5:$E$304,4,1)","v":0.10880000000000001},{"$f":"IF(F12=$D$4,K12+N12,MIN($D$5,K12+N12))","v":0},{"$f":"L12+M12","v":0},{"$f":"D3","v":0},0,{"$f":"L12*I12/365.25*H12","v":0},{"$f":"MIN(J12-Q12-P12,L12)","v":0},{"$f":"MIN(J12-Q12,N12)","v":0},{"$f":"MIN(J12,M12)","v":0},{"$f":"MAX(N12-P12,0)","v":0},{"$f":"L12-O12","v":0},{"$f":"M12+R12-Q12","v":0}]
[null,null,null,null,null,2,{"$f":"EOMONTH($D$9,F13-1)","v":"2017-05-31"},{"$f":"G13-G12","v":31},{"$f":"VLOOKUP(G13,'Прогноз переменной ставки'!$B$5:$E$304,4,1)","v":0.10880000000000001},{"$f":"IF(F13=$D$4,K13+N13,MIN($D$5,K13+N13))","v":0},{"$f":"L13+M13","v":0},{"$f":"S12","v":0},{"$f":"T12","v":0},{"$f":"L13*I13/365.25*H13","v":0},0,0,0,{"$f":"MAX(N13-P13,0)","v":0},0,0]
[null,null,null,null,null,3,"2017-06-30",{"$f":"G14-G13","v":30},{"$f":"VLOOKUP(G14,'Прогноз переменной ставки'!$B$5:$E$304,4,1)","v":0.10880000000000001},0,0,{"$f":"S13","v":0},0,0,0,0,0,{"$f":"MAX(N14-P14,0)","v":0},0,0]
[null,null,null,null,null,4,"2017-07-31",31,{"$f":"VLOOKUP(G15,'Прогноз переменной ставки'!$B$5:$E$304,4,1)","v":9.2300000000000007E-2},0,0,0,0,0,0,0,0,0,0,0]
{"$rows_left_out":297}
{"sheet":"График_300","index":9,"n_rows":312,"n_cols":20,"rows_kept":312,"cut":false,"hidden":true,"merged":[]}
[]
[null,"Параметр ",null,"Значение"]
[null,"Сумма кредита",null,{"$f":"'Калькулятор_от дохода'!$T$66","v":0}]
[null,"Первоначальный срок, мес.",null,{"$f":"'Расчет по доходу заемщика'!$H$41","v":300}]
[null,"Ежемесячный платеж",null,{"$f":"'Калькулятор_от дохода'!$T$72","v":0}]
[null,"Расчетный период полного погашения",null,{"$f":"MATCH(0,K12:K312,0)-1","v":0}]
[null,"остаток долга на конец срока кредита",null,{"$f":"VLOOKUP(D4+1,$F$12:$L$263,4)","v":9.9000000000000005E-2}]
[null,"Переплата",null,{"$f":"SUM($J$12:$J$311)-D3","v":0},null,null,null,null,null,null,null,null,"График платежей"]
[null,"дата выдачи",null,{"$f":"'Калькулятор_от дохода'!$V$20","v":"2017-04-01"}]
[null,null,null,null,null,null,"Последняя дата процентного периода","Кол-во дней в процентном периоде","Ставка для расчетов","Ежемесячный платеж","Общий долг на начало","Остаток кредита на начало","Накопленные %% на начало","Начислено за месяц","Погашение кредита","Погашение текущих %","Погашение накопленных %%","Формирование накопленных %%","Остаток кредита на конец периода","Накопленные %% на конец периода"]
[null,null,null,null,null,1,2,3,2,3,4,5,6,7,8,9,10,11,12,13]
[null,null,null,null,null,1,{"$f":"EOMONTH($D$9,F12-1)","v":"2017-04-30"},{"$f":"G12-D9","v":29},{"$f":"VLOOKUP(G12,'Прогноз переменной ставки'!$B$5:$E$304,4,1)","v":0.10880000000000001},{"$f":"IF(F12=$D$4,K12+N12,MIN($D$5,K12+N12))","v":0},{"$f":"L12+M12","v":0},{"$f":"D3","v":0},0,{"$f":"L12*I12/365.25*H12","v":0},{"$f":"MIN(J12-Q12-P12,L12)","v":0},{"$f":"MIN(J12-Q12,N12)","v":0},{"$f":"MIN(J12,M12)","v":0},{"$f":"MAX(N12-P12,0)","v":0},{"$f":"L12-O12","v":0},{"$f":"M12+R12-Q12","v":0}]
[null,null,null,null,null,2,{"$f":"EOMONTH($D$9,F13-1)","v":"2017-05-31"},{"$f":"G13-G12","v":31},{"$f":"VLOOKUP(G13,'Прогноз переменной ставки'!$B$5:$E$304,4,1)","v":0.10880000000000001},{"$f":"IF(F13=$D$4,K13+N13,MIN($D$5,K13+N13))","v":0},{"$f":"L13+M13","v":0},{"$f":"S12","v":0},{"$f":"T12","v":0},{"$f":"L13*I13/365.25*H13","v":0},0,0,0,{"$f":"MAX(N13-P13,0)","v":0},0,0]
[null,null,null,null,null,3,"2017-06-30",{"$f":"G14-G13","v":30},{"$f":"VLOOKUP(G14,'Прогноз переменной ставки'!$B$5:$E$304,4,1)","v":0.10880000000000001},0,0,{"$f":"S13","v":0},0,0,0,0,0,{"$f":"MAX(N14-P14,0)","v":0},0,0]
[null,null,null,null,null,4,"2017-07-31",31,{"$f":"VLOOKUP(G15,'Прогноз переменной ставки'!$B$5:$E$304,4,1)","v":9.2300000000000007E-2},0,0,0,0,0,0,0,0,0,0,0]
{"$rows_left_out":298}
{"sheet":"График_360","index":10,"n_rows":372,"n_cols":20,"rows_kept":372,"cut":false,"hidden":true,"merged":[]}
[]
[null,"Параметр ",null,"Значение"]
[null,"Сумма кредита",null,{"$f":"'Калькулятор_от дохода'!V66","v":0}]
[null,"Первоначальный срок, мес.",null,{"$f":"'Расчет по доходу заемщика'!$I$41","v":360}]
[null,"Ежемесячный платеж",null,{"$f":"'Калькулятор_от дохода'!$V$72","v":0}]
[null,"Расчетный период полного погашения",null,{"$f":"MATCH(0,K12:K372,0)-1","v":0}]
[null,"остаток долга на конец срока кредита",null,{"$f":"VLOOKUP(D4+1,$F$12:$L$371,4)","v":9.9000000000000005E-2}]
[null,"Переплата",null,{"$f":"SUM($J$12:$J$371)-D3","v":0},null,null,null,null,null,null,null,null,"График платежей"]
[null,"дата выдачи",null,{"$f":"'Калькулятор_от дохода'!$V$20","v":"2017-04-01"}]
[null,null,null,null,null,null,"Последняя дата процентного периода","Кол-во дней в процентном периоде","Ставка для расчетов","Ежемесячный платеж","Общий долг на начало","Остаток кредита на начало","Накопленные %% на начало","Начислено за месяц","Погашение кредита","Погашение текущих %","Погашение накопленных %%","Формирование накопленных %%","Остаток кредита на конец периода","Накопленные %% на конец периода"]
[null,null,null,null,null,1,2,3,4,5,6,7,8,9,10,11,12,13,14,15]
[null,null,null,null,null,1,{"$f":"EOMONTH($D$9,F12-1)","v":"2017-04-30"},{"$f":"G12-D9","v":29},{"$f":"VLOOKUP(G12,'Прогноз переменной ставки'!$B$5:$E$364,4,1)","v":0.10880000000000001},{"$f":"IF(F12=$D$4,K12+N12,MIN($D$5,K12+N12))","v":0},{"$f":"L12+M12","v":0},{"$f":"D3","v":0},0,{"$f":"L12*I12/365.25*H12","v":0},{"$f":"MIN(J12-Q12-P12,L12)","v":0},{"$f":"MIN(J12-Q12,N12)","v":0},{"$f":"MIN(J12,M12)","v":0},{"$f":"MAX(N12-P12,0)","v":0},{"$f":"L12-O12","v":0},{"$f":"M12+R12-Q12","v":0}]
[null,null,null,null,null,2,{"$f":"EOMONTH($D$9,F13-1)","v":"2017-05-31"},{"$f":"G13-G12","v":31},{"$f":"VLOOKUP(G13,'Прогноз переменной ставки'!$B$5:$E$304,4,1)","v":0.10880000000000001},{"$f":"IF(F13=$D$4,K13+N13,MIN($D$5,K13+N13))","v":0},{"$f":"L13+M13","v":0},{"$f":"S12","v":0},{"$f":"T12","v":0},{"$f":"L13*I13/365.25*H13","v":0},0,0,0,{"$f":"MAX(N13-P13,0)","v":0},0,0]
[null,null,null,null,null,3,"2017-06-30",{"$f":"G14-G13","v":30},{"$f":"VLOOKUP(G14,'Прогноз переменной ставки'!$B$5:$E$304,4,1)","v":0.10880000000000001},0,0,{"$f":"S13","v":0},0,0,0,0,0,{"$f":"MAX(N14-P14,0)","v":0},0,0]
[null,null,null,null,null,4,"2017-07-31",31,{"$f":"VLOOKUP(G15,'Прогноз переменной ставки'!$B$5:$E$304,4,1)","v":9.2300000000000007E-2},0,0,0,0,0,0,0,0,0,0,0]
{"$rows_left_out":358}
{"sheet":"Прогноз переменной ставки","index":11,"n_rows":364,"n_cols":5,"rows_kept":364,"cut":false,"hidden":true,"merged":[]}
[null,"Надбавка за ЛС",{"$f":"IF('Калькулятор_от дохода'!$P$49=\"да\",0,0.7%)","v":0},null,"Надбавка Легкая ипотека"]
[null,"Надбавка для Справку по форме кредитора",{"$f":"IF('Калькулятор_от дохода'!$P$18=\"да\",0.5%,0)","v":0},null,{"$f":"IF('Калькулятор_от дохода'!$P$24=\"да\",0.5%,0)","v":0}]
[]
[null,"Период","Прогноз инфляции","Прогноз ставки","Прогноз ставки с учетом надбавок"]
[1,"2016-09-01",5.2600000000000001E-2,{"$f":"C5+4.9%","v":0.1016},{"$f":"D5+$C$1+$C$2+$E$2","v":0.1016}]
[2,"2016-10-01",3.6499999999999998E-2,{"$f":"C6+4.9%","v":8.5499999999999993E-2},{"$f":"D6+$C$1+$C$2+$E$2","v":8.5499999999999993E-2}]
[3,"2016-11-01",3.6499999999999998E-2,8.5499999999999993E-2,8.5499999999999993E-2]
[4,"2016-12-01",3.6499999999999998E-2,8.5499999999999993E-2,8.5499999999999993E-2]
[5,"2017-01-01",4.1700000000000001E-2,{"$f":"C9+5.9%","v":0.10070000000000001},0.10070000000000001]
[6,"2017-02-01",4.1700000000000001E-2,{"$f":"C10+5.9%","v":0.10070000000000001},0.10070000000000001]
[7,"2017-03-01",4.1700000000000001E-2,0.10070000000000001,0.10070000000000001]
[8,"2017-04-01",4.9799999999999997E-2,0.10880000000000001,0.10880000000000001]
[9,"2017-05-01",4.9799999999999997E-2,0.10880000000000001,0.10880000000000001]
[10,"2017-06-01",4.9799999999999997E-2,0.10880000000000001,0.10880000000000001]
[11,"2017-07-01",3.3300000000000003E-2,9.2300000000000007E-2,9.2300000000000007E-2]
{"$rows_left_out":350}
{"sheet":"Графики","index":12,"n_rows":0,"n_cols":0,"rows_kept":0,"cut":false,"hidden":true,"merged":[]}

{"sheet":"ШаблонПечати","index":13,"n_rows":34,"n_cols":15,"rows_kept":34,"cut":false,"hidden":true,"merged":[[3,5,3,9],[29,1,29,14],[238,1,238,14],[1,0,1,14],[3,3,3,4],[4,3,4,4],[5,3,5,4],[6,3,6,6],[27,1,27,14],[6,7,6,8],[7,7,7,8],[31,1,31,14],[4,5,4,9],[5,5,5,9],[7,3,7,6],[8,3,8,6],[236,1,236,14],[9,3,9,6],[8,7,8,8],[9,7,9,8],[234,1,234,14],[33,1,33,14]]}
[]
[]
[]
[]
[]
[]
[]
[]
[]
[]
[]
[]
[]
[]
[]
{"$rows_left_out":20}
{"sheet":"Справочник","index":14,"n_rows":412,"n_cols":5,"rows_kept":412,"cut":false,"hidden":true,"merged":[[1,1,1,5]]}
[]
[null,"Справочник плановых процентной ставки "]
[]
[null,null,"Дата начала периода","Прогнозная ставка","Ежемесячный платеж"]
[null,null,"2016-01-01",0.13200000000000001,{"$f":"ROUNDUP(SubsCredSumm*Параметры!H30/12/(1-(1+Параметры!H30/12)^(2-KD_period))*0.95,0)","v":8149}]
[null,null,"2016-02-01",0.13200000000000001,{"$f":"E5","v":8149}]
[null,null,"2016-03-01",0.13200000000000001,{"$f":"E6","v":8149}]
[null,null,"2016-04-01",0.14410000000000001,8149]
[null,null,"2016-05-01",0.14410000000000001,8149]
[null,null,"2016-06-01",0.14410000000000001,8149]
[null,null,"2016-07-01",0.1016,8149]
[null,null,"2016-08-01",0.1016,8149]
[null,null,"2016-09-01",0.1016,8149]
[null,null,"2016-10-01",8.5500000000000007E-2,8149]
[null,null,"2016-11-01",8.5500000000000007E-2,8149]
{"$rows_left_out":398}
{"sheet":"Инструкция","index":15,"n_rows":0,"n_cols":0,"rows_kept":0,"cut":false,"hidden":true,"merged":[]}

{"sheet":"Лист1","index":16,"n_rows":100,"n_cols":3,"rows_kept":100,"cut":false,"hidden":true,"merged":[[2,1,4,1]]}
[null,"Величина прожиточного минимума трудоспособного населения, рублей"]
[null,"В случае отсутствия данных по какому-либо региону необходимо использовать последние имеющиеся данные"]
[null,""]
[null,null,"Вступают в действие с 1 августа 2016 года"]
[null,null,"трудоспособное население"]
[1,"Российская Федерация",10524]
[2,"ЦЕНТРАЛЬНЫЙ ФО"]
[3,"Белгородская область",8703]
[4,"Брянская область",9727]
[5,"Владимирская область",9962]
[6,"Воронежская область",8824]
[7,"Ивановская область",10227]
[8,"Калужская область",10121]
[9,"Костромская область",9862]
[10,"Курская область",8980]
{"$rows_left_out":85}