{"text_format":"1","workbook":"xlsx","n_sheets":5,"sheets":["Ввод данных","График платежей","График платежей_ФГКУ","Справочники","Анализ результатов"],"not_rendered":{"charts":0,"images":0,"macros":1,"external_links":0,"defined_names":5,"comments":0,"pivot_tables":0},"unopened":[],"bounds":{"document_bytes":16777216,"sheet_cells":100000,"rows_first":2000,"rows_last":500,"rows_between":2000,"halvings":0,"cell_chars":16384,"cell_head_chars":4096},"cells_cut":0,"cells_raw":0,"read":"whole","date_system":"1900"}

{"sheet":"Ввод данных","index":0,"n_rows":57,"n_cols":13,"rows_kept":57,"cut":false,"hidden":false,"merged":[[2,9,2,11],[36,9,36,11]]}
[]
[null,null,null,null,null,null,null,null,null,"v. 1.0"]
[null,null,null,null,null,null,null,null,null,"Расчет максимальной суммы кредита для заемщика по продукту \"Военная ипотека\""]
[]
[null,null,null,null,null,null,null,null,null,"поля для ввода-"]
[]
[null,null,null,null,null,null,null,null,null,"поля с результатами расчета-"]
[]
[null,null,null,null,null,null,null,null,null,"Процентная ставка",null,0.115]
[]
[null,null,null,null,null,null,null,null,null,"Дата рождения заемщика",null,"1995-01-02"]
[]
[null,null,null,null,null,null,null,null,null,"Плановая дата подписания кредитного договора, до:",null,"2017-01-15"]
[]
[null,null,null,null,null,null,null,null,null,"Срок целевого жилищного займа (ЦЖЗ) согласно свидетельству, до: ",null,"2040-02-01"]
[]
[null,null,null,null,null,null,null,null,null,"При изменении любых вводных параметоров необходимо нажать кнопку пересчета суммы кредита"]
[]
[null,null,null,null,null,null,null,null,null,"Расчетная максимальная сумма кредита для заемщика, руб.",null,2210000]
[]
[null,null,null,null,null,null,null,null,null,"Максимальная сумма кредита, руб.",null,{"$f":"IF(MIN(L19,VLOOKUP($L$9,Справочники!$Q$3:$R$4,2,FALSE))<Справочники!$R$7,0,MIN(L19,VLOOKUP($L$9,Справочники!$Q$3:$R$4,2,FALSE)))","v":2100000}]
[]
[]
[null,null,null,null,null,null,null,null,null,"Предельная дата выдачи кредита (дата договора + 2 мес.), до:",null,{"$f":"EDATE(L13,Справочники!$O$7)","v":"2017-03-15"}]
[]
[null,null,null,null,null,null,null,null,null,"Срок кредитного договора, мес. с даты выдачи кредита",null,{"$f":"DATEDIF(L24,L30,\"M\")+1","v":275}]
[]
[null,null,null,null,null,null,null,null,null,"Возраст заемщика на дату выдачи кредита",null,{"$f":"DATEDIF($L$11,$L$24,\"Y\")& \" г \"&DATEDIF($L$11,$L$24,\"M\")-_xlfn.FLOOR.MATH(DATEDIF($L$11,$L$24,\"M\"),12)&\" м\"","v":"22 г 2 м"}]
[]
[null,null,null,null,null,null,null,null,null,"Срок кредитного договора, по:",{"$f":"IFERROR(IF(DATEDIF(L24,L30,\"M\")<Справочники!$O$9,\"!\",\"\"),\"!\")","v":""},{"$f":"EOMONTH(L15,-1)","v":"2040-01-31"}]
{"$rows_left_out":28}
{"sheet":"График платежей","index":1,"n_rows":370,"n_cols":23,"rows_kept":370,"cut":false,"hidden":true,"merged":[]}
[]
[null,"Параметр ",null,"Значение"]
[null,"Сумма кредита",null,2210000]
[null,"Ставка",null,{"$f":"'Ввод данных'!$L$9","v":0.115}]
[null,"Максимальный срок, мес.",null,{"$f":"'Ввод данных'!$L$30","v":"2040-01-31"}]
[null,"Расчетный период полного погашения",null,{"$f":"MATCH(0,V11:V370,0)","v":230}]
[null,"Остаток долга на конец срока кредита",null,{"$f":"VLOOKUP(D5,$G$11:$O$370,8,TRUE)","v":0}]
[null,"Расчетная дата полного погашения",null,{"$f":"VLOOKUP(D6,$F$11:$H$370,3,FALSE)","v":"2036-04-30"},null,null,null,null,null,null,null,null,null,null,null,"График платежей"]
[null,"Возраст заемщика на дату погашения кредита",null,{"$f":"YEARFRAC('Ввод данных'!L11,$D$8)","v":41.327777777777776},null,null,"Начало процентного периода","Конец месяца (процентного периода)","Процентный период, дн.","День недели","Первый рабочий день нового месяца","Кол-во дней в году","Платеж ","Общий долга на начало","ОД на начало","Накопленные %% на начало","Начислено за месяц","Погашение ОД","Погашение текущих %","Погашение накопленных %%","Формирование накопленных %%","ОД на конец периода","Накопленные %% на конец периода"]
[]
[null,null,null,null,null,1,{"$f":"'Ввод данных'!$L$24","v":"2017-03-15"},{"$f":"EOMONTH(G11,0)","v":"2017-03-31"},{"$f":"H11-G11","v":16},{"$f":"WEEKDAY(H11,11)","v":5},{"$f":"WORKDAY(H11,IF(OR(J11=6,J11=7),1,0))","v":"2017-03-31"},{"$f":"VLOOKUP(YEAR(G11),Справочники!$C$3:$I$33,7,FALSE)","v":365},{"$f":"VLOOKUP(YEAR(G11),Справочники!$C$3:$D$33,2,FALSE)","v":21680},{"$f":"O11+P11","v":2210000},{"$f":"D3","v":2210000},0,{"$f":"O11*$D$4/L11*I11","v":11140.82191780822},0,0,0,{"$f":"MAX(Q11-S11,0)","v":11140.82191780822},{"$f":"O11-R11","v":2210000},{"$f":"P11+U11-T11","v":11140.82191780822}]
[null,null,null,null,null,2,{"$f":"H11+1","v":"2017-04-01"},{"$f":"EOMONTH(G12,0)","v":"2017-04-30"},{"$f":"H12-G12+1","v":30},{"$f":"WEEKDAY(H12,11)","v":7},{"$f":"WORKDAY(H12,IF(OR(J12=6,J12=7),1,0))","v":"2017-05-01"},{"$f":"VLOOKUP(YEAR(G12),Справочники!$C$3:$I$33,7,FALSE)","v":365},{"$f":"VLOOKUP(YEAR(G12),Справочники!$C$3:$D$33,2,FALSE)+MIN(W11,M11)","v":32820.821917808222},{"$f":"O12+P12","v":2221140.8219178081},{"$f":"V11","v":2210000},{"$f":"W11","v":11140.82191780822},{"$f":"O12*$D$4/L12*I12","v":20889.041095890414},{"$f":"MIN(M12-T12-S12,O12)","v":790.958904109586},{"$f":"MIN(M12-T12,Q12)","v":20889.041095890414},{"$f":"MIN(M12,P12)","v":11140.82191780822},{"$f":"MAX(Q12-S12,0)","v":0},{"$f":"O12-R12","v":2209209.0410958906},0]
[null,null,null,null,null,3,{"$f":"H12+1","v":"2017-05-01"},"2017-05-31",{"$f":"H13-G13+1","v":31},3,"2017-05-31",{"$f":"VLOOKUP(YEAR(G13),Справочники!$C$3:$I$33,7,FALSE)","v":365},{"$f":"VLOOKUP(YEAR(G13),Справочники!$C$3:$D$33,2,FALSE)","v":21680},2209209.0410958906,{"$f":"V12","v":2209209.0410958906},0,{"$f":"O13*$D$4/L13*I13","v":21577.61707262151},102.38292737849042,21577.61707262151,0,{"$f":"MAX(Q13-S13,0)","v":0},2209106.6581685119,0]
[null,null,null,null,null,4,"2017-06-01","2017-06-30",30,5,"2017-06-30",{"$f":"VLOOKUP(YEAR(G14),Справочники!$C$3:$I$33,7,FALSE)","v":365},{"$f":"VLOOKUP(YEAR(G14),Справочники!$C$3:$D$33,2,FALSE)","v":21680},2209106.6581685119,2209106.6581685119,0,20880.597179948949,799.40282005105109,20880.597179948949,0,0,2208307.2553484607,0]
[null,null,null,null,null,5,"2017-07-01","2017-07-31",31,1,"2017-07-31",{"$f":"VLOOKUP(YEAR(G15),Справочники!$C$3:$I$33,7,FALSE)","v":365},{"$f":"VLOOKUP(YEAR(G15),Справочники!$C$3:$D$33,2,FALSE)","v":21680},2208307.2553484607,2208307.2553484607,0,21568.809220047297,111.19077995270345,21568.809220047297,0,0,2208196.064568508,0]
[null,null,null,null,null,6,"2017-08-01","2017-08-31",31,4,"2017-08-31",{"$f":"VLOOKUP(YEAR(G16),Справочники!$C$3:$I$33,7,FALSE)","v":365},{"$f":"VLOOKUP(YEAR(G16),Справочники!$C$3:$D$33,2,FALSE)","v":21680},2208196.064568508,2208196.064568508,0,21567.723205991042,112.27679400895795,21567.723205991042,0,0,2208083.787774499,0]
[null,null,null,null,null,7,"2017-09-01","2017-09-30",30,6,"2017-10-02",{"$f":"VLOOKUP(YEAR(G17),Справочники!$C$3:$I$33,7,FALSE)","v":365},{"$f":"VLOOKUP(YEAR(G17),Справочники!$C$3:$D$33,2,FALSE)","v":21680},2208083.787774499,{"$f":"V16","v":2208083.787774499},{"$f":"W16","v":0},20870.928952937047,809.07104706295286,20870.928952937047,0,{"$f":"MAX(Q17-S17,0)","v":0},2207274.7167274361,0]
[null,null,null,null,null,8,"2017-10-01","2017-10-31",31,2,"2017-10-31",{"$f":"VLOOKUP(YEAR(G18),Справочники!$C$3:$I$33,7,FALSE)","v":365},{"$f":"VLOOKUP(YEAR(G18),Справочники!$C$3:$D$33,2,FALSE)","v":21680},2207274.7167274361,{"$f":"V17","v":2207274.7167274361},{"$f":"W17","v":0},21558.724288036465,121.27571196353529,21558.724288036465,0,0,2207153.4410154726,0]
[null,null,null,null,null,9,"2017-11-01","2017-11-30",30,4,"2017-11-30",{"$f":"VLOOKUP(YEAR(G19),Справочники!$C$3:$I$33,7,FALSE)","v":365},{"$f":"VLOOKUP(YEAR(G19),Справочники!$C$3:$D$33,2,FALSE)","v":21680},2207153.4410154726,2207153.4410154726,0,20862.135264392826,817.86473560717423,20862.135264392826,0,0,2206335.5762798656,0]
[null,null,null,null,null,10,"2017-12-01","2017-12-31",31,7,"2018-01-01",{"$f":"VLOOKUP(YEAR(G20),Справочники!$C$3:$I$33,7,FALSE)","v":365},{"$f":"VLOOKUP(YEAR(G20),Справочники!$C$3:$D$33,2,FALSE)","v":21680},2206335.5762798656,2206335.5762798656,0,21549.551587500606,130.44841249939418,21549.551587500606,0,0,2206205.1278673662,0]
[null,null,null,null,null,11,"2018-01-01","2018-01-31",31,3,"2018-01-31",{"$f":"VLOOKUP(YEAR(G21),Справочники!$C$3:$I$33,7,FALSE)","v":365},{"$f":"VLOOKUP(YEAR(G21),Справочники!$C$3:$D$33,2,FALSE)","v":21680},2206205.1278673662,2206205.1278673662,0,21548.277481773042,131.72251822695762,21548.277481773042,0,0,2206073.4053491391,0]
[null,null,null,null,null,12,"2018-02-01","2018-02-28",28,3,"2018-02-28",{"$f":"VLOOKUP(YEAR(G22),Справочники!$C$3:$I$33,7,FALSE)","v":365},{"$f":"VLOOKUP(YEAR(G22),Справочники!$C$3:$D$33,2,FALSE)","v":21680},2206073.4053491391,2206073.4053491391,0,19461.798260888296,2218.2017391117042,19461.798260888296,0,0,2203855.2036100272,0]
[null,null,null,null,null,13,"2018-03-01","2018-03-31",31,6,"2018-04-02",{"$f":"VLOOKUP(YEAR(G23),Справочники!$C$3:$I$33,7,FALSE)","v":365},{"$f":"VLOOKUP(YEAR(G23),Справочники!$C$3:$D$33,2,FALSE)","v":21680},2203855.2036100272,{"$f":"V22","v":2203855.2036100272},{"$f":"W22","v":0},21525.325481834923,154.67451816507673,21525.325481834923,0,0,2203700.529091862,0]
[null,null,null,null,null,14,"2018-04-01","2018-04-30",30,1,"2018-04-30",{"$f":"VLOOKUP(YEAR(G24),Справочники!$C$3:$I$33,7,FALSE)","v":365},{"$f":"VLOOKUP(YEAR(G24),Справочники!$C$3:$D$33,2,FALSE)","v":21680},2203700.529091862,2203700.529091862,0,20829.498151690204,850.50184830979561,20829.498151690204,0,0,2202850.0272435523,0]
[null,null,null,null,null,15,"2018-05-01","2018-05-31",31,4,"2018-05-31",{"$f":"VLOOKUP(YEAR(G25),Справочники!$C$3:$I$33,7,FALSE)","v":365},{"$f":"VLOOKUP(YEAR(G25),Справочники!$C$3:$D$33,2,FALSE)","v":21680},2202850.0272435523,2202850.0272435523,0,21515.507800337709,164.49219966229066,21515.507800337709,0,0,2202685.5350438901,0]
[null,null,null,null,null,16,"2018-06-01","2018-06-30",30,6,"2018-07-02",{"$f":"VLOOKUP(YEAR(G26),Справочники!$C$3:$I$33,7,FALSE)","v":365},{"$f":"VLOOKUP(YEAR(G26),Справочники!$C$3:$D$33,2,FALSE)","v":21680},2202685.5350438901,2202685.5350438901,0,20819.904372332661,860.0956276673387,20819.904372332661,0,0,2201825.4394162227,0]
[null,null,null,null,null,17,"2018-07-01","2018-07-31",31,2,"2018-07-31",{"$f":"VLOOKUP(YEAR(G27),Справочники!$C$3:$I$33,7,FALSE)","v":365},{"$f":"VLOOKUP(YEAR(G27),Справочники!$C$3:$D$33,2,FALSE)","v":21680},2201825.4394162227,2201825.4394162227,0,21505.500524709136,174.49947529086421,21505.500524709136,0,0,2201650.9399409317,0]
[null,null,null,null,null,18,"2018-08-01","2018-08-31",31,5,"2018-08-31",{"$f":"VLOOKUP(YEAR(G28),Справочники!$C$3:$I$33,7,FALSE)","v":365},{"$f":"VLOOKUP(YEAR(G28),Справочники!$C$3:$D$33,2,FALSE)","v":21680},2201650.9399409317,2201650.9399409317,0,21503.796166820332,176.20383317966844,21503.796166820332,0,0,2201474.7361077522,0]
[null,null,null,null,null,19,"2018-09-01","2018-09-30",30,7,"2018-10-01",{"$f":"VLOOKUP(YEAR(G29),Справочники!$C$3:$I$33,7,FALSE)","v":365},{"$f":"VLOOKUP(YEAR(G29),Справочники!$C$3:$D$33,2,FALSE)","v":21680},2201474.7361077522,2201474.7361077522,0,20808.459834443136,871.54016555686394,20808.459834443136,0,0,2200603.1959421951,0]
[null,null,null,null,null,20,"2018-10-01","2018-10-31",31,3,"2018-10-31",{"$f":"VLOOKUP(YEAR(G30),Справочники!$C$3:$I$33,7,FALSE)","v":365},{"$f":"VLOOKUP(YEAR(G30),Справочники!$C$3:$D$33,2,FALSE)","v":21680},2200603.1959421951,2200603.1959421951,0,21493.562722010756,186.43727798924374,21493.562722010756,0,0,2200416.7586642057,0]
{"$rows_left_out":341}
{"sheet":"График платежей_ФГКУ","index":2,"n_rows":370,"n_cols":23,"rows_kept":370,"cut":false,"hidden":true,"merged":[]}
[]
[null,"Параметр ",null,"Значение"]
[null,"Сумма кредита",null,{"$f":"'График платежей'!$D$3","v":2210000}]
[null,"Ставка",null,{"$f":"'График платежей'!$D$4","v":0.115}]
[null,"Максимальный срок, мес.",null,{"$f":"'График платежей'!$D$5","v":"2040-01-31"}]
[null,"Расчетный период полного погашения",null,{"$f":"MATCH(0,V11:V370,0)","v":176}]
[null,"Остаток долга на конец срока кредита",null,{"$f":"VLOOKUP(D5,$G$11:$O$370,8,TRUE)","v":0}]
[null,"Расчетная дата полного погашения",null,{"$f":"VLOOKUP(D6,$F$11:$H$370,3,FALSE)","v":"2031-10-31"},null,null,null,null,null,null,null,null,null,null,null,"График платежей"]
[null,"Возраст заемщика на даты погашения, лет",null,{"$f":"YEARFRAC('Ввод данных'!L11,$D$8)","v":36.830555555555556},null,null,"Начало процентного периода","Конец месяца (процентного периода)","Процентный период, дн.","День недели","Первый рабочий день нового месяца","Кол-во дней в году","Платеж ","Общий долга на начало","ОД на начало","Накопленные %% на начало","Начислено за месяц","Погашение ОД","Погашение текущих %","Погашение накопленных %%","Формирование накопленных %%","ОД на конец периода","Накопленные %% на конец периода"]
[]
[null,null,null,null,null,1,{"$f":"'Ввод данных'!$L$24","v":"2017-03-15"},{"$f":"EOMONTH(G11,0)","v":"2017-03-31"},{"$f":"H11-G11","v":16},{"$f":"WEEKDAY(H11,11)","v":5},{"$f":"WORKDAY(H11,IF(OR(J11=6,J11=7),1,0))","v":"2017-03-31"},{"$f":"VLOOKUP(YEAR(G11),Справочники!$C$3:$I$33,7,FALSE)","v":365},{"$f":"VLOOKUP(YEAR(G11),Справочники!$C$3:$F$33,4,FALSE)","v":21680},{"$f":"O11+P11","v":2210000},{"$f":"D3","v":2210000},0,{"$f":"O11*$D$4/L11*I11","v":11140.82191780822},0,0,0,{"$f":"MAX(Q11-S11,0)","v":11140.82191780822},{"$f":"O11-R11","v":2210000},{"$f":"P11+U11-T11","v":11140.82191780822}]
[null,null,null,null,null,2,{"$f":"H11+1","v":"2017-04-01"},{"$f":"EOMONTH(G12,0)","v":"2017-04-30"},{"$f":"H12-G12+1","v":30},{"$f":"WEEKDAY(H12,11)","v":7},{"$f":"WORKDAY(H12,IF(OR(J12=6,J12=7),1,0))","v":"2017-05-01"},{"$f":"VLOOKUP(YEAR(G12),Справочники!$C$3:$I$33,7,FALSE)","v":365},{"$f":"VLOOKUP(YEAR(G12),Справочники!$C$3:$F$33,4,FALSE)+MIN(W11,M11)","v":32820.821917808222},{"$f":"O12+P12","v":2221140.8219178081},{"$f":"V11","v":2210000},{"$f":"W11","v":11140.82191780822},{"$f":"O12*$D$4/L12*I12","v":20889.041095890414},{"$f":"MIN(M12-T12-S12,O12)","v":790.958904109586},{"$f":"MIN(M12-T12,Q12)","v":20889.041095890414},{"$f":"MIN(M12,P12)","v":11140.82191780822},{"$f":"MAX(Q12-S12,0)","v":0},{"$f":"O12-R12","v":2209209.0410958906},0]
[null,null,null,null,null,3,{"$f":"H12+1","v":"2017-05-01"},"2017-05-31",{"$f":"H13-G13+1","v":31},3,"2017-05-31",{"$f":"VLOOKUP(YEAR(G13),Справочники!$C$3:$I$33,7,FALSE)","v":365},{"$f":"VLOOKUP(YEAR(G13),Справочники!$C$3:$F$33,4,FALSE)","v":21680},2209209.0410958906,{"$f":"V12","v":2209209.0410958906},0,{"$f":"O13*$D$4/L13*I13","v":21577.61707262151},102.38292737849042,21577.61707262151,0,{"$f":"MAX(Q13-S13,0)","v":0},2209106.6581685119,0]
[null,null,null,null,null,4,"2017-06-01","2017-06-30",30,5,"2017-06-30",{"$f":"VLOOKUP(YEAR(G14),Справочники!$C$3:$I$33,7,FALSE)","v":365},{"$f":"VLOOKUP(YEAR(G14),Справочники!$C$3:$F$33,4,FALSE)","v":21680},2209106.6581685119,2209106.6581685119,0,20880.597179948949,799.40282005105109,20880.597179948949,0,0,2208307.2553484607,0]
[null,null,null,null,null,5,"2017-07-01","2017-07-31",31,1,"2017-07-31",{"$f":"VLOOKUP(YEAR(G15),Справочники!$C$3:$I$33,7,FALSE)","v":365},{"$f":"VLOOKUP(YEAR(G15),Справочники!$C$3:$F$33,4,FALSE)","v":21680},2208307.2553484607,2208307.2553484607,0,21568.809220047297,111.19077995270345,21568.809220047297,0,0,2208196.064568508,0]
[null,null,null,null,null,6,"2017-08-01","2017-08-31",31,4,"2017-08-31",{"$f":"VLOOKUP(YEAR(G16),Справочники!$C$3:$I$33,7,FALSE)","v":365},{"$f":"VLOOKUP(YEAR(G16),Справочники!$C$3:$F$33,4,FALSE)","v":21680},2208196.064568508,2208196.064568508,0,21567.723205991042,112.27679400895795,21567.723205991042,0,0,2208083.787774499,0]
[null,null,null,null,null,7,"2017-09-01","2017-09-30",30,6,"2017-10-02",{"$f":"VLOOKUP(YEAR(G17),Справочники!$C$3:$I$33,7,FALSE)","v":365},{"$f":"VLOOKUP(YEAR(G17),Справочники!$C$3:$F$33,4,FALSE)","v":21680},2208083.787774499,{"$f":"V16","v":2208083.787774499},{"$f":"W16","v":0},20870.928952937047,809.07104706295286,20870.928952937047,0,{"$f":"MAX(Q17-S17,0)","v":0},2207274.7167274361,0]
[null,null,null,null,null,8,"2017-10-01","2017-10-31",31,2,"2017-10-31",{"$f":"VLOOKUP(YEAR(G18),Справочники!$C$3:$I$33,7,FALSE)","v":365},{"$f":"VLOOKUP(YEAR(G18),Справочники!$C$3:$F$33,4,FALSE)","v":21680},2207274.7167274361,{"$f":"V17","v":2207274.7167274361},{"$f":"W17","v":0},21558.724288036465,121.27571196353529,21558.724288036465,0,0,2207153.4410154726,0]
[null,null,null,null,null,9,"2017-11-01","2017-11-30",30,4,"2017-11-30",{"$f":"VLOOKUP(YEAR(G19),Справочники!$C$3:$I$33,7,FALSE)","v":365},{"$f":"VLOOKUP(YEAR(G19),Справочники!$C$3:$F$33,4,FALSE)","v":21680},2207153.4410154726,2207153.4410154726,0,20862.135264392826,817.86473560717423,20862.135264392826,0,0,2206335.5762798656,0]
[null,null,null,null,null,10,"2017-12-01","2017-12-31",31,7,"2018-01-01",{"$f":"VLOOKUP(YEAR(G20),Справочники!$C$3:$I$33,7,FALSE)","v":365},{"$f":"VLOOKUP(YEAR(G20),Справочники!$C$3:$F$33,4,FALSE)","v":21680},2206335.5762798656,2206335.5762798656,0,21549.551587500606,130.44841249939418,21549.551587500606,0,0,2206205.1278673662,0]
[null,null,null,null,null,11,"2018-01-01","2018-01-31",31,3,"2018-01-31",{"$f":"VLOOKUP(YEAR(G21),Справочники!$C$3:$I$33,7,FALSE)","v":365},{"$f":"VLOOKUP(YEAR(G21),Справочники!$C$3:$F$33,4,FALSE)","v":23050},2206205.1278673662,2206205.1278673662,0,21548.277481773042,1501.7225182269576,21548.277481773042,0,0,2204703.4053491391,0]
[null,null,null,null,null,12,"2018-02-01","2018-02-28",28,3,"2018-02-28",{"$f":"VLOOKUP(YEAR(G22),Справочники!$C$3:$I$33,7,FALSE)","v":365},{"$f":"VLOOKUP(YEAR(G22),Справочники!$C$3:$F$33,4,FALSE)","v":23050},2204703.4053491391,2204703.4053491391,0,19449.712233491038,3600.2877665089618,19449.712233491038,0,0,2201103.1175826304,0]
[null,null,null,null,null,13,"2018-03-01","2018-03-31",31,6,"2018-04-02",{"$f":"VLOOKUP(YEAR(G23),Справочники!$C$3:$I$33,7,FALSE)","v":365},{"$f":"VLOOKUP(YEAR(G23),Справочники!$C$3:$F$33,4,FALSE)","v":23050},2201103.1175826304,{"$f":"V22","v":2201103.1175826304},{"$f":"W22","v":0},21498.44551830706,1551.5544816929396,21498.44551830706,0,0,2199551.5631009373,0]
[null,null,null,null,null,14,"2018-04-01","2018-04-30",30,1,"2018-04-30",{"$f":"VLOOKUP(YEAR(G24),Справочники!$C$3:$I$33,7,FALSE)","v":365},{"$f":"VLOOKUP(YEAR(G24),Справочники!$C$3:$F$33,4,FALSE)","v":23050},2199551.5631009373,2199551.5631009373,0,20790.281897803379,2259.7181021966207,20790.281897803379,0,0,2197291.8449987406,0]
[null,null,null,null,null,15,"2018-05-01","2018-05-31",31,4,"2018-05-31",{"$f":"VLOOKUP(YEAR(G25),Справочники!$C$3:$I$33,7,FALSE)","v":365},{"$f":"VLOOKUP(YEAR(G25),Справочники!$C$3:$F$33,4,FALSE)","v":23050},2197291.8449987406,2197291.8449987406,0,21461.220349097286,1588.7796509027139,21461.220349097286,0,0,2195703.0653478377,0]
[null,null,null,null,null,16,"2018-06-01","2018-06-30",30,6,"2018-07-02",{"$f":"VLOOKUP(YEAR(G26),Справочники!$C$3:$I$33,7,FALSE)","v":365},{"$f":"VLOOKUP(YEAR(G26),Справочники!$C$3:$F$33,4,FALSE)","v":23050},2195703.0653478377,2195703.0653478377,0,20753.905686164493,2296.0943138355069,20753.905686164493,0,0,2193406.971034002,0]
[null,null,null,null,null,17,"2018-07-01","2018-07-31",31,2,"2018-07-31",{"$f":"VLOOKUP(YEAR(G27),Справочники!$C$3:$I$33,7,FALSE)","v":365},{"$f":"VLOOKUP(YEAR(G27),Справочники!$C$3:$F$33,4,FALSE)","v":23050},2193406.971034002,2193406.971034002,0,21423.276306126623,1626.7236938733768,21423.276306126623,0,0,2191780.2473401288,0]
[null,null,null,null,null,18,"2018-08-01","2018-08-31",31,5,"2018-08-31",{"$f":"VLOOKUP(YEAR(G28),Справочники!$C$3:$I$33,7,FALSE)","v":365},{"$f":"VLOOKUP(YEAR(G28),Справочники!$C$3:$F$33,4,FALSE)","v":23050},2191780.2473401288,2191780.2473401288,0,21407.387895253589,1642.6121047464112,21407.387895253589,0,0,2190137.6352353822,0]
[null,null,null,null,null,19,"2018-09-01","2018-09-30",30,7,"2018-10-01",{"$f":"VLOOKUP(YEAR(G29),Справочники!$C$3:$I$33,7,FALSE)","v":365},{"$f":"VLOOKUP(YEAR(G29),Справочники!$C$3:$F$33,4,FALSE)","v":23050},2190137.6352353822,2190137.6352353822,0,20701.30093578649,2348.6990642135097,20701.30093578649,0,0,2187788.9361711689,0]
[null,null,null,null,null,20,"2018-10-01","2018-10-31",31,3,"2018-10-31",{"$f":"VLOOKUP(YEAR(G30),Справочники!$C$3:$I$33,7,FALSE)","v":365},{"$f":"VLOOKUP(YEAR(G30),Справочники!$C$3:$F$33,4,FALSE)","v":23050},2187788.9361711689,2187788.9361711689,0,21368.404266986898,1681.5957330131023,21368.404266986898,0,0,2186107.3404381559,0]
{"$rows_left_out":341}
{"sheet":"Справочники","index":3,"n_rows":33,"n_cols":20,"rows_kept":33,"cut":false,"hidden":true,"merged":[]}
[]
[null,null,"Год","Прогноз для расчета","Индекс","Прогноз ФГКУ в 2016г.","Индекс","Отклонение расчет/ФГКУ (\"запас прочности\")","Ко-во дней в году","Високосный (да/нет)",null,null,"Справочник Банков для перечисления платежей участника НИС",null,"Сумма накоплений для оплаты ПВ",null,"Процентная ставка","Максимальная сумма по продукту",null,"Максимальный К/З"]
[null,null,2016,20490,"-",20490,"-",null,{"$f":"IF(J3=\"да\",366,365)","v":366},"да",null,null,"Столбец1",null,1400000,null,0.115,2100000,null,0.8]
[null,null,2017,{"$f":"D3*(1+E4)","v":21680},5.8077110785749175E-2,21680,{"$f":"F4/F3-1","v":5.8077110785749175E-2},{"$f":"D4/F4","v":1},{"$f":"IF(J4=\"да\",366,365)","v":365},"нет",null,null,"Сбербанк",null,null,null,0.125,1930000]
[null,null,2018,{"$f":"D4*(1+E5)","v":21680},0,23050,{"$f":"F5/F4-1","v":6.3191881918819082E-2},{"$f":"D5/F5","v":0.94056399132321045},365,"нет",null,null,"ВТБ24"]
[null,null,2019,21680,0,23995,4.0997830802603108E-2,0.90352156699312358,365,"нет",null,null,"Газпромбанк",null,"Период с даты подписания до даты выдачи КД, мес.",null,null,"минимальная сумма по продукту"]
[null,null,2020,21680,0,24810,3.396540946030413E-2,0.87384119306731156,366,"да",null,null,"Связь-Банк",null,2,null,null,300000]
[null,null,2021,22352.857718661831,3.1035872632003247E-2,25580,3.1035872632003247E-2,0.87384119306731167,365,"нет",null,null,"Зенит",null,"минимальный срок кредита, мес."]
[null,null,2022,23021.34623135833,2.9906176700547515E-2,26345.000000000004,2.9906176700547515E-2,0.87384119306731167,365,"нет",null,null,"Иной",null,3]
[null,null,2023,23663.6195082628,2.7899032074397256E-2,27080,2.7899032074397256E-2,0.87384119306731167,365,"нет"]
[null,null,2024,24301.523579201941,2.6957163958641228E-2,27810.000000000004,2.6957163958641228E-2,0.87384119306731167,366,"да"]
[null,null,2025,24834.566706972997,2.1934555915138265E-2,28420,2.1934555915138265E-2,0.87384119306731167,365,"нет"]
[null,null,2026,25354.502216848046,2.0935960591133007E-2,29015,2.0935960591133007E-2,0.87384119306731156,365,"нет"]
[null,null,2027,25887.545344619106,2.1023608478373257E-2,29625,2.1023608478373257E-2,0.87384119306731156,365,"нет"]
[null,null,2028,26429.326884320835,2.0928270042193997E-2,30245,2.0928270042193997E-2,0.87384119306731145,366,"да"]
[null,null,2029,26958.000806126562,2.000330633162517E-2,30850,2.000330633162517E-2,0.87384119306731156,365,"нет"]
[null,null,2030,27469.197904070941,1.8962722852512215E-2,31435,1.8962722852512215E-2,0.87384119306731167,365,"нет"]
[null,null,2031,28019.717855703351,2.0041355177350173E-2,32065,2.0041355177350173E-2,0.87384119306731178,365,"нет"]
[null,null,2032,28578.976219266431,1.995945735225324E-2,32705,1.995945735225324E-2,0.87384119306731178,366,"да"]
[null,null,2033,29151.342200725521,2.0027518728023219E-2,33360,2.0027518728023219E-2,0.87384119306731178,365,"нет"]
[null,null,2034,29732.446594115285,1.9934052757793808E-2,34025,1.9934052757793808E-2,0.87384119306731178,365,"нет"]
[null,null,2035,30326.658605401059,1.9985304922850888E-2,34705,1.9985304922850888E-2,0.87384119306731189,365,"нет"]
[null,null,2036,30933.978234582843,2.0025932862699936E-2,35400,2.0025932862699936E-2,0.87384119306731189,366,"да"]
[null,null,2037,30933.978234582843,0,35400,0,0.87384119306731189,365,"нет"]
[null,null,2038,30933.978234582843,0,35400,0,0.87384119306731189,365,"нет"]
[null,null,2039,30933.978234582843,0,35400,0,0.87384119306731189,365,"нет"]
[null,null,2040,30933.978234582843,0,35400,0,0.87384119306731189,366,"да"]
[null,null,2041,30933.978234582843,0,35400,0,0.87384119306731189,365,"нет"]
[null,null,2042,30933.978234582843,0,35400,0,0.87384119306731189,365,"нет"]
[null,null,2043,30933.978234582843,0,35400,0,0.87384119306731189,365,"нет"]
{"$rows_left_out":4}
{"sheet":"Анализ результатов","index":4,"n_rows":4,"n_cols":5,"rows_kept":4,"cut":false,"hidden":true,"merged":[]}
[]
[null,null,"Платежи по стравочнику АИЖК","Платежи по прогнозу ФГКУ","\"Запас по сроку\""]
[null,"Возраст заемщика на дату окончания кредитного договора",{"$f":"'Ввод данных'!$L$32","v":"45 г 0 м"},{"$f":"'Ввод данных'!$L$32","v":"45 г 0 м"}]
[null,"Возраст заемщика на расчетную дату погашание кредита, лет.",{"$f":"'График платежей'!$D$9","v":41.327777777777776},{"$f":"'График платежей_ФГКУ'!$D$9","v":36.830555555555556},{"$f":"C4-D4","v":4.49722222222222}]