{"text_format":"1","workbook":"xlsx","n_sheets":5,"sheets":["Ввод данных","График платежей","График платежей_ФГКУ","Справочники","Анализ результатов"],"not_rendered":{"charts":0,"images":0,"macros":1,"external_links":0,"defined_names":6,"comments":0,"pivot_tables":0},"unopened":[],"bounds":{"document_bytes":16777216,"sheet_cells":100000,"rows_first":2000,"rows_last":500,"rows_between":2000,"halvings":0,"cell_chars":16384,"cell_head_chars":4096},"cells_cut":0,"cells_raw":0,"read":"whole","date_system":"1900"}

{"sheet":"Ввод данных","index":0,"n_rows":63,"n_cols":13,"rows_kept":63,"cut":false,"hidden":false,"merged":[[2,9,2,11],[36,9,36,11]]}
[]
[null,null,null,null,null,null,null,null,null,"v. 2.0"]
[null,null,null,null,null,null,null,null,null,"Расчет максимальной суммы кредита для заемщика по продукту \"Военная ипотека\""]
[]
[null,null,null,null,null,null,null,null,null,"поля для ввода-"]
[]
[null,null,null,null,null,null,null,null,null,"поля с результатами расчета-"]
[]
[null,null,null,null,null,null,null,null,null,"Процентная ставка",null,0.115]
[]
[null,null,null,null,null,null,null,null,null,"Дата рождения заемщика",null,"1995-01-02"]
[]
[null,null,null,null,null,null,null,null,null,"Предельная дата выдачи кредита, до:",null,"2017-01-15",{"$f":"IF(L26<Справочники!$O$19,\"Кредит д.б. выдан раньше либо кредитования невозможно\")","v":false}]
[]
[null,null,null,null,null,null,null,null,null,"Срок целевого жилищного займа (ЦЖЗ) согласно свидетельству, до: ",null,"2040-02-01"]
[]
[null,null,null,null,null,null,null,null,null,"При изменении любых вводных параметоров необходимо нажать кнопку пересчета суммы кредита"]
[]
[null,null,null,null,null,null,null,null,null,"Расчетная максимальная сумма кредита для заемщика, руб.",null,2810000]
[]
[null,null,null,null,null,null,null,null,null,"Максимальная сумма кредита, руб.",null,{"$f":"IF(MIN(L19,VLOOKUP($L$9,Справочники!$Q$3:$S$4,3,FALSE))<Справочники!$R$7,0,MIN(L19,VLOOKUP($L$9,Справочники!$Q$3:$S$4,3,FALSE)))","v":2100000}]
[]
[]
[null,null,null,null,null,null,null,null,null,"Предельная дата выдачи кредита (дата договора + 2 мес.), до:"]
[]
[null,null,null,null,null,null,null,null,null,{"$f":"\"Срок кредитного договора, мес. с даты выдачи кредита \"&IF(L26<Справочники!$O$19,\"(min 36 мес.)\",\"\")","v":"Срок кредитного договора, мес. с даты выдачи кредита "},null,{"$f":"DATEDIF(L13,L30,\"M\")+1","v":277},{"$f":"IF(L26<Справочники!$O$19,\"Срок кредита меньше допустимого\")","v":false}]
[]
[null,null,null,null,null,null,null,null,null,"Возраст заемщика на дату выдачи кредита",null,{"$f":"DATEDIF($L$11,$L$13,\"Y\")& \" г \"&DATEDIF($L$11,$L$13,\"M\")-_xlfn.FLOOR.MATH(DATEDIF($L$11,$L$13,\"M\"),12)&\" м\"","v":"22 г 0 м"}]
[]
[null,null,null,null,null,null,null,null,null,"Срок кредитного договора, по:",{"$f":"IFERROR(IF(DATEDIF(L24,L30,\"M\")<Справочники!$O$9,\"!\",\"\"),\"!\")","v":""},{"$f":"EOMONTH(L15,-1)","v":"2040-01-31"}]
{"$rows_left_out":34}
{"sheet":"График платежей","index":1,"n_rows":370,"n_cols":23,"rows_kept":370,"cut":false,"hidden":true,"merged":[]}
[]
[null,"Параметр ",null,"Значение"]
[null,"Сумма кредита",null,2810000]
[null,"Ставка",null,{"$f":"'Ввод данных'!$L$9","v":0.115}]
[null,"Максимальный срок кредита.",null,{"$f":"'Ввод данных'!$L$30","v":"2040-01-31"}]
[null,"Расчетный период полного погашения",null,{"$f":"MATCH(0,V11:V370,0)","v":{"$error":"#N/A"}}]
[null,"Остаток долга на конец срока кредита",null,{"$f":"VLOOKUP(D5,$G$11:$O$370,8,TRUE)","v":2934526.1009190772}]
[null,"Расчетная дата полного погашения",null,{"$f":"VLOOKUP(D6,$F$11:$H$370,3,FALSE)","v":{"$error":"#N/A"}},null,null,null,null,null,null,null,null,null,null,null,"График платежей"]
[null,"Возраст заемщика на дату погашения кредита",null,{"$f":"YEARFRAC('Ввод данных'!L11,$D$8)","v":{"$error":"#N/A"}},null,null,"Начало процентного периода","Конец месяца (процентного периода)","Процентный период, дн.","День недели","Первый рабочий день нового месяца","Кол-во дней в году","Платеж ","Общий долга на начало","ОД на начало","Накопленные %% на начало","Начислено за месяц","Погашение ОД","Погашение текущих %","Погашение накопленных %%","Формирование накопленных %%","ОД на конец периода","Накопленные %% на конец периода"]
[]
[null,null,null,null,null,1,{"$f":"'Ввод данных'!$L$13","v":"2017-01-15"},{"$f":"EOMONTH(G11,0)","v":"2017-01-31"},{"$f":"H11-G11","v":16},{"$f":"WEEKDAY(H11,11)","v":2},{"$f":"WORKDAY(H11,IF(OR(J11=6,J11=7),1,0))","v":"2017-01-31"},{"$f":"VLOOKUP(YEAR(G11),Справочники!$C$3:$I$33,7,FALSE)","v":365},{"$f":"VLOOKUP(YEAR(G11),Справочники!$C$3:$D$33,2,FALSE)","v":21678},{"$f":"O11+P11","v":2810000},{"$f":"D3","v":2810000},0,{"$f":"O11*$D$4/L11*I11","v":14165.479452054795},0,0,0,{"$f":"MAX(Q11-S11,0)","v":14165.479452054795},{"$f":"O11-R11","v":2810000},{"$f":"P11+U11-T11","v":14165.479452054795}]
[null,null,null,null,null,2,{"$f":"H11+1","v":"2017-02-01"},{"$f":"EOMONTH(G12,0)","v":"2017-02-28"},{"$f":"H12-G12+1","v":28},{"$f":"WEEKDAY(H12,11)","v":2},{"$f":"WORKDAY(H12,IF(OR(J12=6,J12=7),1,0))","v":"2017-02-28"},{"$f":"VLOOKUP(YEAR(G12),Справочники!$C$3:$I$33,7,FALSE)","v":365},{"$f":"VLOOKUP(YEAR(G12),Справочники!$C$3:$D$33,2,FALSE)+MIN(W11,M11)","v":35843.479452054795},{"$f":"O12+P12","v":2824165.4794520549},{"$f":"V11","v":2810000},{"$f":"W11","v":14165.479452054795},{"$f":"O12*$D$4/L12*I12","v":24789.589041095889},{"$f":"MIN(M12-T12-S12,O12)","v":0},{"$f":"MIN(M12-T12,Q12)","v":21678},{"$f":"MIN(M12,P12)","v":14165.479452054795},{"$f":"MAX(Q12-S12,0)","v":3111.5890410958891},{"$f":"O12-R12","v":2810000},3111.5890410958891]
[null,null,null,null,null,3,{"$f":"H12+1","v":"2017-03-01"},"2017-03-31",{"$f":"H13-G13+1","v":31},5,"2017-03-31",{"$f":"VLOOKUP(YEAR(G13),Справочники!$C$3:$I$33,7,FALSE)","v":365},{"$f":"VLOOKUP(YEAR(G13),Справочники!$C$3:$D$33,2,FALSE)+IF('Ввод данных'!$L$49=\"да\",'Ввод данных'!$L$47,0)","v":21678},2813111.5890410957,{"$f":"V12","v":2810000},3111.5890410958891,{"$f":"O13*$D$4/L13*I13","v":27445.616438356166},0,18566.410958904111,3111.5890410958891,{"$f":"MAX(Q13-S13,0)","v":8879.2054794520554},2810000,8879.2054794520554]
[null,null,null,null,null,4,"2017-04-01","2017-04-30",30,7,"2017-05-01",{"$f":"VLOOKUP(YEAR(G14),Справочники!$C$3:$I$33,7,FALSE)","v":365},{"$f":"VLOOKUP(YEAR(G14),Справочники!$C$3:$D$33,2,FALSE)","v":21678},2818879.2054794519,2810000,8879.2054794520554,26560.273972602739,0,12798.794520547945,8879.2054794520554,13761.479452054795,2810000,13761.479452054795]
[null,null,null,null,null,5,"2017-05-01","2017-05-31",31,3,"2017-05-31",{"$f":"VLOOKUP(YEAR(G15),Справочники!$C$3:$I$33,7,FALSE)","v":365},{"$f":"VLOOKUP(YEAR(G15),Справочники!$C$3:$D$33,2,FALSE)","v":21678},2823761.4794520549,2810000,13761.479452054795,27445.616438356166,0,7916.5205479452052,13761.479452054795,19529.095890410961,2810000,19529.095890410965]
[null,null,null,null,null,6,"2017-06-01","2017-06-30",30,5,"2017-06-30",{"$f":"VLOOKUP(YEAR(G16),Справочники!$C$3:$I$33,7,FALSE)","v":365},{"$f":"VLOOKUP(YEAR(G16),Справочники!$C$3:$D$33,2,FALSE)","v":21678},2829529.0958904112,2810000,19529.095890410965,26560.273972602739,0,2148.9041095890352,19529.095890410965,24411.369863013704,2810000,24411.369863013701]
[null,null,null,null,null,7,"2017-07-01","2017-07-31",31,1,"2017-07-31",{"$f":"VLOOKUP(YEAR(G17),Справочники!$C$3:$I$33,7,FALSE)","v":365},{"$f":"VLOOKUP(YEAR(G17),Справочники!$C$3:$D$33,2,FALSE)","v":21678},2834411.3698630137,{"$f":"V16","v":2810000},{"$f":"W16","v":24411.369863013701},27445.616438356166,0,0,21678,{"$f":"MAX(Q17-S17,0)","v":27445.616438356166},2810000,30178.986301369863]
[null,null,null,null,null,8,"2017-08-01","2017-08-31",31,4,"2017-08-31",{"$f":"VLOOKUP(YEAR(G18),Справочники!$C$3:$I$33,7,FALSE)","v":365},{"$f":"VLOOKUP(YEAR(G18),Справочники!$C$3:$D$33,2,FALSE)","v":21678},2840178.98630137,{"$f":"V17","v":2810000},{"$f":"W17","v":30178.986301369863},27445.616438356166,0,0,21678,27445.616438356166,2810000,35946.602739726033]
[null,null,null,null,null,9,"2017-09-01","2017-09-30",30,6,"2017-10-02",{"$f":"VLOOKUP(YEAR(G19),Справочники!$C$3:$I$33,7,FALSE)","v":365},{"$f":"VLOOKUP(YEAR(G19),Справочники!$C$3:$D$33,2,FALSE)","v":21678},2845946.6027397262,2810000,35946.602739726033,26560.273972602739,0,0,21678,26560.273972602739,2810000,40828.876712328769]
[null,null,null,null,null,10,"2017-10-01","2017-10-31",31,2,"2017-10-31",{"$f":"VLOOKUP(YEAR(G20),Справочники!$C$3:$I$33,7,FALSE)","v":365},{"$f":"VLOOKUP(YEAR(G20),Справочники!$C$3:$D$33,2,FALSE)","v":21678},2850828.8767123288,2810000,40828.876712328769,27445.616438356166,0,0,21678,27445.616438356166,2810000,46596.493150684939]
[null,null,null,null,null,11,"2017-11-01","2017-11-30",30,4,"2017-11-30",{"$f":"VLOOKUP(YEAR(G21),Справочники!$C$3:$I$33,7,FALSE)","v":365},{"$f":"VLOOKUP(YEAR(G21),Справочники!$C$3:$D$33,2,FALSE)","v":21678},2856596.493150685,2810000,46596.493150684939,26560.273972602739,0,0,21678,26560.273972602739,2810000,51478.767123287675]
[null,null,null,null,null,12,"2017-12-01","2017-12-31",31,7,"2018-01-01",{"$f":"VLOOKUP(YEAR(G22),Справочники!$C$3:$I$33,7,FALSE)","v":365},{"$f":"VLOOKUP(YEAR(G22),Справочники!$C$3:$D$33,2,FALSE)","v":21678},2861478.7671232875,2810000,51478.767123287675,27445.616438356166,0,0,21678,27445.616438356166,2810000,57246.383561643845]
[null,null,null,null,null,13,"2018-01-01","2018-01-31",31,3,"2018-01-31",{"$f":"VLOOKUP(YEAR(G23),Справочники!$C$3:$I$33,7,FALSE)","v":365},{"$f":"VLOOKUP(YEAR(G23),Справочники!$C$3:$D$33,2,FALSE)","v":21678},2867246.3835616438,{"$f":"V22","v":2810000},{"$f":"W22","v":57246.383561643845},27445.616438356166,0,0,21678,27445.616438356166,2810000,63014.000000000015]
[null,null,null,null,null,14,"2018-02-01","2018-02-28",28,3,"2018-02-28",{"$f":"VLOOKUP(YEAR(G24),Справочники!$C$3:$I$33,7,FALSE)","v":365},{"$f":"VLOOKUP(YEAR(G24),Справочники!$C$3:$D$33,2,FALSE)","v":21678},2873014,2810000,63014.000000000015,24789.589041095889,0,0,21678,24789.589041095889,2810000,66125.589041095896]
[null,null,null,null,null,15,"2018-03-01","2018-03-31",31,6,"2018-04-02",{"$f":"VLOOKUP(YEAR(G25),Справочники!$C$3:$I$33,7,FALSE)","v":365},{"$f":"VLOOKUP(YEAR(G25),Справочники!$C$3:$D$33,2,FALSE)","v":21678},2876125.5890410957,2810000,66125.589041095896,27445.616438356166,0,0,21678,27445.616438356166,2810000,71893.205479452066]
[null,null,null,null,null,16,"2018-04-01","2018-04-30",30,1,"2018-04-30",{"$f":"VLOOKUP(YEAR(G26),Справочники!$C$3:$I$33,7,FALSE)","v":365},{"$f":"VLOOKUP(YEAR(G26),Справочники!$C$3:$D$33,2,FALSE)","v":21678},2881893.2054794519,2810000,71893.205479452066,26560.273972602739,0,0,21678,26560.273972602739,2810000,76775.479452054802]
[null,null,null,null,null,17,"2018-05-01","2018-05-31",31,4,"2018-05-31",{"$f":"VLOOKUP(YEAR(G27),Справочники!$C$3:$I$33,7,FALSE)","v":365},{"$f":"VLOOKUP(YEAR(G27),Справочники!$C$3:$D$33,2,FALSE)","v":21678},2886775.4794520549,2810000,76775.479452054802,27445.616438356166,0,0,21678,27445.616438356166,2810000,82543.095890410972]
[null,null,null,null,null,18,"2018-06-01","2018-06-30",30,6,"2018-07-02",{"$f":"VLOOKUP(YEAR(G28),Справочники!$C$3:$I$33,7,FALSE)","v":365},{"$f":"VLOOKUP(YEAR(G28),Справочники!$C$3:$D$33,2,FALSE)","v":21678},2892543.0958904112,2810000,82543.095890410972,26560.273972602739,0,0,21678,26560.273972602739,2810000,87425.369863013708]
[null,null,null,null,null,19,"2018-07-01","2018-07-31",31,2,"2018-07-31",{"$f":"VLOOKUP(YEAR(G29),Справочники!$C$3:$I$33,7,FALSE)","v":365},{"$f":"VLOOKUP(YEAR(G29),Справочники!$C$3:$D$33,2,FALSE)","v":21678},2897425.3698630137,2810000,87425.369863013708,27445.616438356166,0,0,21678,27445.616438356166,2810000,93192.986301369878]
[null,null,null,null,null,20,"2018-08-01","2018-08-31",31,5,"2018-08-31",{"$f":"VLOOKUP(YEAR(G30),Справочники!$C$3:$I$33,7,FALSE)","v":365},{"$f":"VLOOKUP(YEAR(G30),Справочники!$C$3:$D$33,2,FALSE)","v":21678},2903192.98630137,2810000,93192.986301369878,27445.616438356166,0,0,21678,27445.616438356166,2810000,98960.602739726048]
{"$rows_left_out":341}
{"sheet":"График платежей_ФГКУ","index":2,"n_rows":370,"n_cols":23,"rows_kept":370,"cut":false,"hidden":true,"merged":[]}
[]
[null,"Параметр ",null,"Значение"]
[null,"Сумма кредита",null,{"$f":"'График платежей'!$D$3","v":2810000}]
[null,"Ставка",null,{"$f":"'График платежей'!$D$4","v":0.115}]
[null,"Максимальный срок, мес.",null,{"$f":"'График платежей'!$D$5","v":"2040-01-31"}]
[null,"Расчетный период полного погашения",null,{"$f":"MATCH(0,V11:V370,0)","v":325}]
[null,"Остаток долга на конец срока кредита",null,{"$f":"VLOOKUP(D5,$G$11:$O$370,8,TRUE)","v":1374425.9436586567}]
[null,"Расчетная дата полного погашения",null,{"$f":"VLOOKUP(D6,$F$11:$H$370,3,FALSE)","v":"2044-01-31"},null,null,null,null,null,null,null,null,null,null,null,"График платежей"]
[null,"Возраст заемщика на даты погашения, лет",null,{"$f":"YEARFRAC('Ввод данных'!L11,$D$8)","v":49.080555555555556},null,null,"Начало процентного периода","Конец месяца (процентного периода)","Процентный период, дн.","День недели","Первый рабочий день нового месяца","Кол-во дней в году","Платеж ","Общий долга на начало","ОД на начало","Накопленные %% на начало","Начислено за месяц","Погашение ОД","Погашение текущих %","Погашение накопленных %%","Формирование накопленных %%","ОД на конец периода","Накопленные %% на конец периода"]
[]
[null,null,null,null,null,1,{"$f":"'Ввод данных'!$L$13","v":"2017-01-15"},{"$f":"EOMONTH(G11,0)","v":"2017-01-31"},{"$f":"H11-G11","v":16},{"$f":"WEEKDAY(H11,11)","v":2},{"$f":"WORKDAY(H11,IF(OR(J11=6,J11=7),1,0))","v":"2017-01-31"},{"$f":"VLOOKUP(YEAR(G11),Справочники!$C$3:$I$33,7,FALSE)","v":365},{"$f":"VLOOKUP(YEAR(G11),Справочники!$C$3:$F$33,4,FALSE)","v":21678},{"$f":"O11+P11","v":2810000},{"$f":"D3","v":2810000},0,{"$f":"O11*$D$4/L11*I11","v":14165.479452054795},0,0,0,{"$f":"MAX(Q11-S11,0)","v":14165.479452054795},{"$f":"O11-R11","v":2810000},{"$f":"P11+U11-T11","v":14165.479452054795}]
[null,null,null,null,null,2,{"$f":"H11+1","v":"2017-02-01"},{"$f":"EOMONTH(G12,0)","v":"2017-02-28"},{"$f":"H12-G12+1","v":28},{"$f":"WEEKDAY(H12,11)","v":2},{"$f":"WORKDAY(H12,IF(OR(J12=6,J12=7),1,0))","v":"2017-02-28"},{"$f":"VLOOKUP(YEAR(G12),Справочники!$C$3:$I$33,7,FALSE)","v":365},{"$f":"VLOOKUP(YEAR(G12),Справочники!$C$3:$F$33,4,FALSE)+MIN(W11,M11)","v":35843.479452054795},{"$f":"O12+P12","v":2824165.4794520549},{"$f":"V11","v":2810000},{"$f":"W11","v":14165.479452054795},{"$f":"O12*$D$4/L12*I12","v":24789.589041095889},{"$f":"MIN(M12-T12-S12,O12)","v":0},{"$f":"MIN(M12-T12,Q12)","v":21678},{"$f":"MIN(M12,P12)","v":14165.479452054795},{"$f":"MAX(Q12-S12,0)","v":3111.5890410958891},{"$f":"O12-R12","v":2810000},3111.5890410958891]
[null,null,null,null,null,3,{"$f":"H12+1","v":"2017-03-01"},"2017-03-31",{"$f":"H13-G13+1","v":31},5,"2017-03-31",{"$f":"VLOOKUP(YEAR(G13),Справочники!$C$3:$I$33,7,FALSE)","v":365},{"$f":"VLOOKUP(YEAR(G13),Справочники!$C$3:$F$33,4,FALSE)+IF('Ввод данных'!$L$49=\"да\",'Ввод данных'!$L$47,0)","v":21678},2813111.5890410957,{"$f":"V12","v":2810000},3111.5890410958891,{"$f":"O13*$D$4/L13*I13","v":27445.616438356166},0,18566.410958904111,3111.5890410958891,{"$f":"MAX(Q13-S13,0)","v":8879.2054794520554},2810000,8879.2054794520554]
[null,null,null,null,null,4,"2017-04-01","2017-04-30",30,7,"2017-05-01",{"$f":"VLOOKUP(YEAR(G14),Справочники!$C$3:$I$33,7,FALSE)","v":365},{"$f":"VLOOKUP(YEAR(G14),Справочники!$C$3:$F$33,4,FALSE)","v":21678},2818879.2054794519,2810000,8879.2054794520554,26560.273972602739,0,12798.794520547945,8879.2054794520554,13761.479452054795,2810000,13761.479452054795]
[null,null,null,null,null,5,"2017-05-01","2017-05-31",31,3,"2017-05-31",{"$f":"VLOOKUP(YEAR(G15),Справочники!$C$3:$I$33,7,FALSE)","v":365},{"$f":"VLOOKUP(YEAR(G15),Справочники!$C$3:$F$33,4,FALSE)","v":21678},2823761.4794520549,2810000,13761.479452054795,27445.616438356166,0,7916.5205479452052,13761.479452054795,19529.095890410961,2810000,19529.095890410965]
[null,null,null,null,null,6,"2017-06-01","2017-06-30",30,5,"2017-06-30",{"$f":"VLOOKUP(YEAR(G16),Справочники!$C$3:$I$33,7,FALSE)","v":365},{"$f":"VLOOKUP(YEAR(G16),Справочники!$C$3:$F$33,4,FALSE)","v":21678},2829529.0958904112,2810000,19529.095890410965,26560.273972602739,0,2148.9041095890352,19529.095890410965,24411.369863013704,2810000,24411.369863013701]
[null,null,null,null,null,7,"2017-07-01","2017-07-31",31,1,"2017-07-31",{"$f":"VLOOKUP(YEAR(G17),Справочники!$C$3:$I$33,7,FALSE)","v":365},{"$f":"VLOOKUP(YEAR(G17),Справочники!$C$3:$F$33,4,FALSE)","v":21678},2834411.3698630137,{"$f":"V16","v":2810000},{"$f":"W16","v":24411.369863013701},27445.616438356166,0,0,21678,{"$f":"MAX(Q17-S17,0)","v":27445.616438356166},2810000,30178.986301369863]
[null,null,null,null,null,8,"2017-08-01","2017-08-31",31,4,"2017-08-31",{"$f":"VLOOKUP(YEAR(G18),Справочники!$C$3:$I$33,7,FALSE)","v":365},{"$f":"VLOOKUP(YEAR(G18),Справочники!$C$3:$F$33,4,FALSE)","v":21678},2840178.98630137,{"$f":"V17","v":2810000},{"$f":"W17","v":30178.986301369863},27445.616438356166,0,0,21678,27445.616438356166,2810000,35946.602739726033]
[null,null,null,null,null,9,"2017-09-01","2017-09-30",30,6,"2017-10-02",{"$f":"VLOOKUP(YEAR(G19),Справочники!$C$3:$I$33,7,FALSE)","v":365},{"$f":"VLOOKUP(YEAR(G19),Справочники!$C$3:$F$33,4,FALSE)","v":21678},2845946.6027397262,2810000,35946.602739726033,26560.273972602739,0,0,21678,26560.273972602739,2810000,40828.876712328769]
[null,null,null,null,null,10,"2017-10-01","2017-10-31",31,2,"2017-10-31",{"$f":"VLOOKUP(YEAR(G20),Справочники!$C$3:$I$33,7,FALSE)","v":365},{"$f":"VLOOKUP(YEAR(G20),Справочники!$C$3:$F$33,4,FALSE)","v":21678},2850828.8767123288,2810000,40828.876712328769,27445.616438356166,0,0,21678,27445.616438356166,2810000,46596.493150684939]
[null,null,null,null,null,11,"2017-11-01","2017-11-30",30,4,"2017-11-30",{"$f":"VLOOKUP(YEAR(G21),Справочники!$C$3:$I$33,7,FALSE)","v":365},{"$f":"VLOOKUP(YEAR(G21),Справочники!$C$3:$F$33,4,FALSE)","v":21678},2856596.493150685,2810000,46596.493150684939,26560.273972602739,0,0,21678,26560.273972602739,2810000,51478.767123287675]
[null,null,null,null,null,12,"2017-12-01","2017-12-31",31,7,"2018-01-01",{"$f":"VLOOKUP(YEAR(G22),Справочники!$C$3:$I$33,7,FALSE)","v":365},{"$f":"VLOOKUP(YEAR(G22),Справочники!$C$3:$F$33,4,FALSE)","v":21678},2861478.7671232875,2810000,51478.767123287675,27445.616438356166,0,0,21678,27445.616438356166,2810000,57246.383561643845]
[null,null,null,null,null,13,"2018-01-01","2018-01-31",31,3,"2018-01-31",{"$f":"VLOOKUP(YEAR(G23),Справочники!$C$3:$I$33,7,FALSE)","v":365},{"$f":"VLOOKUP(YEAR(G23),Справочники!$C$3:$F$33,4,FALSE)","v":23050},2867246.3835616438,{"$f":"V22","v":2810000},{"$f":"W22","v":57246.383561643845},27445.616438356166,0,0,23050,27445.616438356166,2810000,61642.000000000015]
[null,null,null,null,null,14,"2018-02-01","2018-02-28",28,3,"2018-02-28",{"$f":"VLOOKUP(YEAR(G24),Справочники!$C$3:$I$33,7,FALSE)","v":365},{"$f":"VLOOKUP(YEAR(G24),Справочники!$C$3:$F$33,4,FALSE)","v":23050},2871642,2810000,61642.000000000015,24789.589041095889,0,0,23050,24789.589041095889,2810000,63381.589041095896]
[null,null,null,null,null,15,"2018-03-01","2018-03-31",31,6,"2018-04-02",{"$f":"VLOOKUP(YEAR(G25),Справочники!$C$3:$I$33,7,FALSE)","v":365},{"$f":"VLOOKUP(YEAR(G25),Справочники!$C$3:$F$33,4,FALSE)","v":23050},2873381.5890410957,2810000,63381.589041095896,27445.616438356166,0,0,23050,27445.616438356166,2810000,67777.205479452066]
[null,null,null,null,null,16,"2018-04-01","2018-04-30",30,1,"2018-04-30",{"$f":"VLOOKUP(YEAR(G26),Справочники!$C$3:$I$33,7,FALSE)","v":365},{"$f":"VLOOKUP(YEAR(G26),Справочники!$C$3:$F$33,4,FALSE)","v":23050},2877777.2054794519,2810000,67777.205479452066,26560.273972602739,0,0,23050,26560.273972602739,2810000,71287.479452054802]
[null,null,null,null,null,17,"2018-05-01","2018-05-31",31,4,"2018-05-31",{"$f":"VLOOKUP(YEAR(G27),Справочники!$C$3:$I$33,7,FALSE)","v":365},{"$f":"VLOOKUP(YEAR(G27),Справочники!$C$3:$F$33,4,FALSE)","v":23050},2881287.4794520549,2810000,71287.479452054802,27445.616438356166,0,0,23050,27445.616438356166,2810000,75683.095890410972]
[null,null,null,null,null,18,"2018-06-01","2018-06-30",30,6,"2018-07-02",{"$f":"VLOOKUP(YEAR(G28),Справочники!$C$3:$I$33,7,FALSE)","v":365},{"$f":"VLOOKUP(YEAR(G28),Справочники!$C$3:$F$33,4,FALSE)","v":23050},2885683.0958904112,2810000,75683.095890410972,26560.273972602739,0,0,23050,26560.273972602739,2810000,79193.369863013708]
[null,null,null,null,null,19,"2018-07-01","2018-07-31",31,2,"2018-07-31",{"$f":"VLOOKUP(YEAR(G29),Справочники!$C$3:$I$33,7,FALSE)","v":365},{"$f":"VLOOKUP(YEAR(G29),Справочники!$C$3:$F$33,4,FALSE)","v":23050},2889193.3698630137,2810000,79193.369863013708,27445.616438356166,0,0,23050,27445.616438356166,2810000,83588.986301369878]
[null,null,null,null,null,20,"2018-08-01","2018-08-31",31,5,"2018-08-31",{"$f":"VLOOKUP(YEAR(G30),Справочники!$C$3:$I$33,7,FALSE)","v":365},{"$f":"VLOOKUP(YEAR(G30),Справочники!$C$3:$F$33,4,FALSE)","v":23050},2893588.98630137,2810000,83588.986301369878,27445.616438356166,0,0,23050,27445.616438356166,2810000,87984.602739726048]
{"$rows_left_out":341}
{"sheet":"Справочники","index":3,"n_rows":33,"n_cols":23,"rows_kept":33,"cut":false,"hidden":true,"merged":[]}
[]
[null,null,"Год","Прогноз для расчета","Индекс","Прогноз ФГКУ в 2016г.","Индекс","Отклонение расчет/ФГКУ (\"запас прочности\")","Ко-во дней в году","Високосный (да/нет)","Прогноз ФГКУ в 2017г.","Индекс","Справочник Банков для перечисления платежей участника НИС",null,"Сумма накоплений для оплаты ПВ",null,"Процентная ставка","Максимальная сумма по продукту","Максимальная сумма кредита с учетом увеличение на размер неиспользованных накоплений",null,null,null,"Максимальный К/З"]
[null,null,2016,20490,"-",20490,"-",null,{"$f":"IF(J3=\"да\",366,365)","v":366},"да",null,null,"Столбец1",null,1400000,null,0.115,2100000,{"$f":"R3+IF('Ввод данных'!$L$49=\"да\",'Ввод данных'!$L$47,0)","v":2100000},null,null,null,0.8]
[null,null,2017,21678,5.8099999999999999E-2,21678,{"$f":"F4/F3-1","v":5.79795021961933E-2},{"$f":"D4/F4","v":1},{"$f":"IF(J4=\"да\",366,365)","v":365},"нет",21678,5.8099999999999999E-2,"Сбербанк",null,null,null,0.125,1930000,{"$f":"R4+IF('Ввод данных'!$L$49=\"да\",'Ввод данных'!$L$47,0)","v":1930000}]
[null,null,2018,{"$f":"D4*(1+E5)","v":21678},0,23050,{"$f":"F5/F4-1","v":6.3289971399575595E-2},{"$f":"D5/F5","v":0.94047722342733187},365,"нет",21678,0,"ВТБ24"]
[null,null,2019,21678,0,23995,4.0997830802603108E-2,0.90343821629506149,365,"нет",21678,0,"Газпромбанк",null,"Период с даты подписания до даты выдачи КД, мес.",null,null,"минимальная сумма по продукту"]
[null,null,2020,21678,0,24810,3.396540946030413E-2,0.87376058041112459,366,"да",21678,0,"Связь-Банк",null,2,null,null,300000]
[null,null,2021,22350.017999999996,3.1E-2,25580,3.1035872632003247E-2,0.87373017982799051,365,"нет",22350,3.1E-2,"Зенит",null,"минимальный срок кредита, мес."]
[null,null,2022,23020.518539999997,0.03,26345.000000000004,2.9906176700547515E-2,0.87380977566900719,365,"нет",23020.5,0.03,"Иной",null,3]
[null,null,2023,23665.093059119998,2.8000000000000001E-2,27080,2.7899032074397256E-2,0.87389560779615949,365,"нет",23665.1,2.8000000000000001E-2]
[null,null,2024,24304.050571716234,2.7E-2,27810.000000000004,2.6957163958641228E-2,0.87393205939288854,366,"да",24304.1,2.7E-2,null,null,"да"]
[null,null,2025,24838.739684293992,2.1999999999999999E-2,28420,2.1934555915138265E-2,0.87398802548536214,365,"нет",24838.7,2.1999999999999999E-2,null,null,"нет"]
[null,null,2026,25360.353217664164,2.1000000000000001E-2,29015,2.0935960591133007E-2,0.87404284741217175,365,"нет",25360.400000000001,2.1000000000000001E-2]
[null,null,2027,25892.92063523511,2.1000000000000001E-2,29625,2.1023608478373257E-2,0.87402263747629061,365,"нет",25892.9,2.1000000000000001E-2,null,null,"Максимальная сумма неиспользованных накоплений для увеличения суммы кредита"]
[null,null,2028,26436.671968575047,2.1000000000000001E-2,30245,2.0928270042193997E-2,0.87408404591089595,366,"да",26436.7,2.1000000000000001E-2,null,null,600000]
[null,null,2029,26965.40540794655,0.02,30850,2.000330633162517E-2,0.87408121257525284,365,"нет",26965.4,0.02]
[null,null,2030,27477.748110697532,1.9E-2,31435,1.8962722852512215E-2,0.87411318946071359,365,"нет",27477.7,1.9E-2]
[null,null,2031,28027.303072911483,0.02,32065,2.0041355177350173E-2,0.87407775059758253,365,"нет",28027.3,0.02,null,null,"Минимальный срок кредита, мес."]
[null,null,2032,28587.849134369713,0.02,32705,1.995945735225324E-2,0.87411249455342344,366,"да",28587.8,0.02,null,null,36]
[null,null,2033,29159.606117057108,0.02,33360,2.0027518728023219E-2,0.87408891238180786,365,"нет",29159.599999999999,0.02]
[null,null,2034,29742.798239398249,0.02,34025,1.9934052757793808E-2,0.87414542951941954,365,"нет",29742.799999999999,0.02]
[null,null,2035,30337.654204186216,0.02,34705,1.9985304922850888E-2,0.87415802346019922,365,"нет",30337.7,0.02]
[null,null,2036,30944.40728826994,0.02,35400,2.0025932862699936E-2,0.87413579910367067,366,"да",30944.400000000001,0.02]
[null,null,2037,31563.295434035339,0.02,35400,0,0.89161851508574408,365,"нет",31563.3,0.02]
[null,null,2038,31563.295434035339,0,35400,0,0.89161851508574408,365,"нет"]
[null,null,2039,31563.295434035339,0,35400,0,0.89161851508574408,365,"нет"]
[null,null,2040,31563.295434035339,0,35400,0,0.89161851508574408,366,"да"]
[null,null,2041,31563.295434035339,0,35400,0,0.89161851508574408,365,"нет"]
[null,null,2042,31563.295434035339,0,35400,0,0.89161851508574408,365,"нет"]
[null,null,2043,31563.295434035339,0,35400,0,0.89161851508574408,365,"нет"]
{"$rows_left_out":4}
{"sheet":"Анализ результатов","index":4,"n_rows":4,"n_cols":5,"rows_kept":4,"cut":false,"hidden":true,"merged":[]}
[]
[null,null,"Платежи по стравочнику АИЖК","Платежи по прогнозу ФГКУ","\"Запас по сроку\""]
[null,"Возраст заемщика на дату окончания кредитного договора",{"$f":"'Ввод данных'!$L$32","v":"45 г 0 м"},{"$f":"'Ввод данных'!$L$32","v":"45 г 0 м"}]
[null,"Возраст заемщика на расчетную дату погашание кредита, лет.",{"$f":"'График платежей'!$D$9","v":{"$error":"#N/A"}},{"$f":"'График платежей_ФГКУ'!$D$9","v":49.080555555555556},{"$f":"C4-D4","v":{"$error":"#N/A"}}]